Forum Lutèce

annamir
 13  1413
13

Problème lors de l'explode du projet

Problème lors de l'explode du projet

Ci-dessous le problème:

[INFO] Scanning for projects...
Downloading: http://dev.lutece.paris.fr/maven_repository/fr/paris/lutece/tools/maven-lutece-plugin/maven-metadata.xml
mars 10, 2014 11:02:10 AM org.apache.maven.wagon.providers.http.httpclient.client.protocol.ResponseProcessCookies processCookies
WARNING: Cookie rejected:  [version: 0][name: JSESSIONID][value: 7D388A2870E9FB229E1015E14B70A4E1][domain: dev.lutece.paris.fr][path: /nexus][expiry: null] . Illegal path attribute  /nexus . Path of origin:  /maven_repository/fr/paris/lutece/tools/maven-lutece-plugin/maven-metadata.xml 
2/2 KB   mars 10, 2014 11:02:10 AM org.apache.maven.wagon.providers.http.httpclient.client.protocol.ResponseProcessCookies processCookies
WARNING: Cookie rejected:  [version: 0][name: JSESSIONID][value: 784F4C750B478E85E3C0ECD2ECCC0E6A][domain: dev.lutece.paris.fr][path: /nexus][expiry: null] . Illegal path attribute  /nexus . Path of origin:  /maven_repository/fr/paris/lutece/tools/maven-lutece-plugin/maven-metadata.xml.sha1 

         
Downloaded: http://dev.lutece.paris.fr/maven_repository/fr/paris/lutece/tools/maven-lutece-plugin/maven-metadata.xml (2 KB at 1.3 KB/sec)
[WARNING] 
[WARNING] Some problems were encountered while building the effective model for fr.paris.lutece:Transfusion:lutece-site:2.0
[WARNING] 'build.plugins.plugin.version' for fr.paris.lutece.tools:maven-lutece-plugin is missing. @ fr.paris.lutece:lutece-parent-pom:2.28, C:\Users\NESTORTECH\.m2\repository\fr\paris\lutece\lutece-parent-pom\2.28\lutece-parent-pom-2.28.pom, line 61, column 21
[WARNING] 'build.plugins.plugin.version' for org.codehaus.mojo:cobertura-maven-plugin is missing. @ fr.paris.lutece:lutece-parent-pom:2.28, C:\Users\NESTORTECH\.m2\repository\fr\paris\lutece\lutece-parent-pom\2.28\lutece-parent-pom-2.28.pom, line 101, column 21
[WARNING] 'build.plugins.plugin.version' for org.apache.maven.plugins:maven-compiler-plugin is missing. @ fr.paris.lutece:lutece-parent-pom:2.28, C:\Users\NESTORTECH\.m2\repository\fr\paris\lutece\lutece-parent-pom\2.28\lutece-parent-pom-2.28.pom, line 69, column 21
[WARNING] 'build.plugins.plugin.version' for org.apache.maven.plugins:maven-surefire-plugin is missing. @ fr.paris.lutece:lutece-parent-pom:2.28, C:\Users\NESTORTECH\.m2\repository\fr\paris\lutece\lutece-parent-pom\2.28\lutece-parent-pom-2.28.pom, line 84, column 21
[WARNING] 'build.plugins.plugin.version' for org.apache.maven.plugins:maven-surefire-report-plugin is missing. @ fr.paris.lutece:lutece-parent-pom:2.28, C:\Users\NESTORTECH\.m2\repository\fr\paris\lutece\lutece-parent-pom\2.28\lutece-parent-pom-2.28.pom, line 111, column 21
[WARNING] 
[WARNING] It is highly recommended to fix these problems because they threaten the stability of your build.
[WARNING] 
[WARNING] For this reason, future Maven versions might no longer support building such malformed projects.
[WARNING] 
Downloading: http://dev.lutece.paris.fr/maven_repository/org/apache/maven/plugins/maven-compiler-plugin/maven-metadata.xml
mars 10, 2014 11:02:11 AM org.apache.maven.wagon.providers.http.httpclient.client.protocol.ResponseProcessCookies processCookies
WARNING: Cookie rejected:  [version: 0][name: JSESSIONID][value: 36380875891FBECF5821A9F6FA47B2D1][domain: dev.lutece.paris.fr][path: /nexus][expiry: null] . Illegal path attribute  /nexus . Path of origin:  /maven_repository/org/apache/maven/plugins/maven-compiler-plugin/maven-metadata.xml 
         
Downloading: http://dev.lutece.paris.fr/maven_repository/org/apache/maven/plugins/maven-surefire-plugin/maven-metadata.xml
mars 10, 2014 11:02:12 AM org.apache.maven.wagon.providers.http.httpclient.client.protocol.ResponseProcessCookies processCookies
WARNING: Cookie rejected:  [version: 0][name: JSESSIONID][value: F0E495CDD5237F607353598887D6193C][domain: dev.lutece.paris.fr][path: /nexus][expiry: null] . Illegal path attribute  /nexus . Path of origin:  /maven_repository/org/apache/maven/plugins/maven-surefire-plugin/maven-metadata.xml 
         
Downloading: http://dev.lutece.paris.fr/maven_repository/org/codehaus/mojo/cobertura-maven-plugin/maven-metadata.xml
mars 10, 2014 11:02:12 AM org.apache.maven.wagon.providers.http.httpclient.client.protocol.ResponseProcessCookies processCookies
WARNING: Cookie rejected:  [version: 0][name: JSESSIONID][value: 5B900783A7A27A1A95535404C68DB8FA][domain: dev.lutece.paris.fr][path: /nexus][expiry: null] . Illegal path attribute  /nexus . Path of origin:  /maven_repository/org/codehaus/mojo/cobertura-maven-plugin/maven-metadata.xml 
         
Downloading: http://dev.lutece.paris.fr/maven_repository/org/apache/maven/plugins/maven-surefire-report-plugin/maven-metadata.xml
mars 10, 2014 11:02:12 AM org.apache.maven.wagon.providers.http.httpclient.client.protocol.ResponseProcessCookies processCookies
WARNING: Cookie rejected:  [version: 0][name: JSESSIONID][value: 0C8504C3D3B518A00B69FECD6A016F68][domain: dev.lutece.paris.fr][path: /nexus][expiry: null] . Illegal path attribute  /nexus . Path of origin:  /maven_repository/org/apache/maven/plugins/maven-surefire-report-plugin/maven-metadata.xml 
         
[INFO]                                                                         
[INFO] ------------------------------------------------------------------------
[INFO] Building Portail transfusion 2.0
[INFO] ------------------------------------------------------------------------
[INFO] 
[INFO]  maven-lutece-plugin:3.0.1:exploded (default-cli) @ Transfusion 
[INFO] 
[INFO]  maven-lutece-plugin:3.0.1:exploded (default-cli) @ Transfusion 
Downloading: http://dev.lutece.paris.fr/snapshot_repository/fr/paris/lutece/plugins/library-rbac-api/maven-metadata.xml
Downloading: http://dev.lutece.paris.fr/maven_repository/fr/paris/lutece/plugins/library-rbac-api/maven-metadata.xml
Downloading: http://repo.maven.apache.org/maven2/fr/paris/lutece/plugins/library-rbac-api/maven-metadata.xml
         
346/346 B   mars 10, 2014 11:02:13 AM org.apache.maven.wagon.providers.http.httpclient.client.protocol.ResponseProcessCookies processCookies
WARNING: Cookie rejected:  [version: 0][name: JSESSIONID][value: E7971FA683CC7F3E39E0912C18DFCD8E][domain: dev.lutece.paris.fr][path: /nexus][expiry: null] . Illegal path attribute  /nexus . Path of origin:  /maven_repository/fr/paris/lutece/plugins/library-rbac-api/maven-metadata.xml 
mars 10, 2014 11:02:13 AM org.apache.maven.wagon.providers.http.httpclient.client.protocol.ResponseProcessCookies processCookies
WARNING: Cookie rejected:  [version: 0][name: JSESSIONID][value: 524F944294A54FB087A97E544F562E29][domain: dev.lutece.paris.fr][path: /nexus][expiry: null] . Illegal path attribute  /nexus . Path of origin:  /snapshot_repository/fr/paris/lutece/plugins/library-rbac-api/maven-metadata.xml 

335/335 B   346/346 B   
                        
Downloaded: http://dev.lutece.paris.fr/maven_repository/fr/paris/lutece/plugins/library-rbac-api/maven-metadata.xml (346 B at 0.7 KB/sec)
mars 10, 2014 11:02:13 AM org.apache.maven.wagon.providers.http.httpclient.client.protocol.ResponseProcessCookies processCookies
WARNING: Cookie rejected:  [version: 0][name: JSESSIONID][value: 785A9709E2142556D628A2B5A518F266][domain: dev.lutece.paris.fr][path: /nexus][expiry: null] . Illegal path attribute  /nexus . Path of origin:  /maven_repository/fr/paris/lutece/plugins/library-rbac-api/maven-metadata.xml.sha1 
mars 10, 2014 11:02:13 AM org.apache.maven.wagon.providers.http.httpclient.client.protocol.ResponseProcessCookies processCookies
WARNING: Cookie rejected:  [version: 0][name: JSESSIONID][value: CF3783512B12EDC05210832C1A9603E2][domain: dev.lutece.paris.fr][path: /nexus][expiry: null] . Illegal path attribute  /nexus . Path of origin:  /snapshot_repository/fr/paris/lutece/plugins/library-rbac-api/maven-metadata.xml.sha1 
                        
Downloaded: http://dev.lutece.paris.fr/snapshot_repository/fr/paris/lutece/plugins/library-rbac-api/maven-metadata.xml (335 B at 0.7 KB/sec)
Downloading: http://dev.lutece.paris.fr/maven_repository/fr/paris/lutece/plugins/library-rbac-api/1.0.1-SNAPSHOT/maven-metadata.xml
Downloading: http://dev.lutece.paris.fr/snapshot_repository/fr/paris/lutece/plugins/library-rbac-api/1.0.1-SNAPSHOT/maven-metadata.xml
mars 10, 2014 11:02:13 AM org.apache.maven.wagon.providers.http.httpclient.client.protocol.ResponseProcessCookies processCookies
WARNING: Cookie rejected:  [version: 0][name: JSESSIONID][value: 14FD6C9DE90E950EC1B5CAC2B77DDA96][domain: dev.lutece.paris.fr][path: /nexus][expiry: null] . Illegal path attribute  /nexus . Path of origin:  /maven_repository/fr/paris/lutece/plugins/library-rbac-api/1.0.1-SNAPSHOT/maven-metadata.xml 
                        mars 10, 2014 11:02:13 AM org.apache.maven.wagon.providers.http.httpclient.client.protocol.ResponseProcessCookies processCookies
WARNING: Cookie rejected:  [version: 0][name: JSESSIONID][value: E06218D54B3CE45C7F15B350EF0A2607][domain: dev.lutece.paris.fr][path: /nexus][expiry: null] . Illegal path attribute  /nexus . Path of origin:  /snapshot_repository/fr/paris/lutece/plugins/library-rbac-api/1.0.1-SNAPSHOT/maven-metadata.xml 

376/376 B               mars 10, 2014 11:02:14 AM org.apache.maven.wagon.providers.http.httpclient.client.protocol.ResponseProcessCookies processCookies
WARNING: Cookie rejected:  [version: 0][name: JSESSIONID][value: A8F94F26FFA8A6E3757D2C7F2E37FE7D][domain: dev.lutece.paris.fr][path: /nexus][expiry: null] . Illegal path attribute  /nexus . Path of origin:  /snapshot_repository/fr/paris/lutece/plugins/library-rbac-api/1.0.1-SNAPSHOT/maven-metadata.xml.sha1 

            
Downloaded: http://dev.lutece.paris.fr/snapshot_repository/fr/paris/lutece/plugins/library-rbac-api/1.0.1-SNAPSHOT/maven-metadata.xml (376 B at 1.2 KB/sec)
Downloading: http://dev.lutece.paris.fr/maven_repository/fr/paris/lutece/plugins/library-workgroup-api/maven-metadata.xml
Downloading: http://repo.maven.apache.org/maven2/fr/paris/lutece/plugins/library-workgroup-api/maven-metadata.xml
Downloading: http://dev.lutece.paris.fr/snapshot_repository/fr/paris/lutece/plugins/library-workgroup-api/maven-metadata.xml
340/340 B   mars 10, 2014 11:02:14 AM org.apache.maven.wagon.providers.http.httpclient.client.protocol.ResponseProcessCookies processCookies
WARNING: Cookie rejected:  [version: 0][name: JSESSIONID][value: 5DDE2F0CEC5BC28FB24777F64F39CABF][domain: dev.lutece.paris.fr][path: /nexus][expiry: null] . Illegal path attribute  /nexus . Path of origin:  /snapshot_repository/fr/paris/lutece/plugins/library-workgroup-api/maven-metadata.xml 

            mars 10, 2014 11:02:14 AM org.apache.maven.wagon.providers.http.httpclient.client.protocol.ResponseProcessCookies processCookies
WARNING: Cookie rejected:  [version: 0][name: JSESSIONID][value: D635FFA5B4629F3137B3E5095897099D][domain: dev.lutece.paris.fr][path: /nexus][expiry: null] . Illegal path attribute  /nexus . Path of origin:  /maven_repository/fr/paris/lutece/plugins/library-workgroup-api/maven-metadata.xml 

351/351 B   340/340 B   
                        
Downloaded: http://dev.lutece.paris.fr/snapshot_repository/fr/paris/lutece/plugins/library-workgroup-api/maven-metadata.xml (340 B at 1.4 KB/sec)
mars 10, 2014 11:02:14 AM org.apache.maven.wagon.providers.http.httpclient.client.protocol.ResponseProcessCookies processCookies
WARNING: Cookie rejected:  [version: 0][name: JSESSIONID][value: 888AEB2DD91C48E2FB946E6B0FF3908B][domain: dev.lutece.paris.fr][path: /nexus][expiry: null] . Illegal path attribute  /nexus . Path of origin:  /snapshot_repository/fr/paris/lutece/plugins/library-workgroup-api/maven-metadata.xml.sha1 
mars 10, 2014 11:02:14 AM org.apache.maven.wagon.providers.http.httpclient.client.protocol.ResponseProcessCookies processCookies
WARNING: Cookie rejected:  [version: 0][name: JSESSIONID][value: 6278362416D143692EEC4FBE3377CD4F][domain: dev.lutece.paris.fr][path: /nexus][expiry: null] . Illegal path attribute  /nexus . Path of origin:  /maven_repository/fr/paris/lutece/plugins/library-workgroup-api/maven-metadata.xml.sha1 
                        
Downloaded: http://dev.lutece.paris.fr/maven_repository/fr/paris/lutece/plugins/library-workgroup-api/maven-metadata.xml (351 B at 1.1 KB/sec)
Downloading: http://dev.lutece.paris.fr/snapshot_repository/fr/paris/lutece/plugins/library-workgroup-api/1.0.1-SNAPSHOT/maven-metadata.xml
Downloading: http://dev.lutece.paris.fr/maven_repository/fr/paris/lutece/plugins/library-workgroup-api/1.0.1-SNAPSHOT/maven-metadata.xml
mars 10, 2014 11:02:14 AM org.apache.maven.wagon.providers.http.httpclient.client.protocol.ResponseProcessCookies processCookies
WARNING: Cookie rejected:  [version: 0][name: JSESSIONID][value: 7960C13298D9902C7328085548090A39][domain: dev.lutece.paris.fr][path: /nexus][expiry: null] . Illegal path attribute  /nexus . Path of origin:  /maven_repository/fr/paris/lutece/plugins/library-workgroup-api/1.0.1-SNAPSHOT/maven-metadata.xml 
                        mars 10, 2014 11:02:14 AM org.apache.maven.wagon.providers.http.httpclient.client.protocol.ResponseProcessCookies processCookies
WARNING: Cookie rejected:  [version: 0][name: JSESSIONID][value: 7F623DCA4A1707C9A17EE395CDD115D1][domain: dev.lutece.paris.fr][path: /nexus][expiry: null] . Illegal path attribute  /nexus . Path of origin:  /snapshot_repository/fr/paris/lutece/plugins/library-workgroup-api/1.0.1-SNAPSHOT/maven-metadata.xml 

381/381 B               mars 10, 2014 11:02:14 AM org.apache.maven.wagon.providers.http.httpclient.client.protocol.ResponseProcessCookies processCookies
WARNING: Cookie rejected:  [version: 0][name: JSESSIONID][value: DC8D7393B3FE15B3D776A16BB964B922][domain: dev.lutece.paris.fr][path: /nexus][expiry: null] . Illegal path attribute  /nexus . Path of origin:  /snapshot_repository/fr/paris/lutece/plugins/library-workgroup-api/1.0.1-SNAPSHOT/maven-metadata.xml.sha1 

            
Downloaded: http://dev.lutece.paris.fr/snapshot_repository/fr/paris/lutece/plugins/library-workgroup-api/1.0.1-SNAPSHOT/maven-metadata.xml (381 B at 1.8 KB/sec)
Downloading: http://dev.lutece.paris.fr/snapshot_repository/fr/paris/lutece/lutece-core/maven-metadata.xml
Downloading: http://dev.lutece.paris.fr/maven_repository/fr/paris/lutece/lutece-core/maven-metadata.xml
Downloading: http://repo.maven.apache.org/maven2/fr/paris/lutece/lutece-core/maven-metadata.xml
mars 10, 2014 11:02:14 AM org.apache.maven.wagon.providers.http.httpclient.client.protocol.ResponseProcessCookies processCookies
WARNING: Cookie rejected:  [version: 0][name: JSESSIONID][value: 031FE0EA7AA5ABD22059859768D01BFF][domain: dev.lutece.paris.fr][path: /nexus][expiry: null] . Illegal path attribute  /nexus . Path of origin:  /snapshot_repository/fr/paris/lutece/lutece-core/maven-metadata.xml 
853/853 B   
            
853/853 B   3/3 KB   mars 10, 2014 11:02:15 AM org.apache.maven.wagon.providers.http.httpclient.client.protocol.ResponseProcessCookies processCookies
WARNING: Cookie rejected:  [version: 0][name: JSESSIONID][value: 547B833A34514AEFE87802ECB8CFBD16][domain: dev.lutece.paris.fr][path: /nexus][expiry: null] . Illegal path attribute  /nexus . Path of origin:  /maven_repository/fr/paris/lutece/lutece-core/maven-metadata.xml 
mars 10, 2014 11:02:15 AM org.apache.maven.wagon.providers.http.httpclient.client.protocol.ResponseProcessCookies processCookies
WARNING: Cookie rejected:  [version: 0][name: JSESSIONID][value: 467D90A573CC9D96E3557162D731863D][domain: dev.lutece.paris.fr][path: /nexus][expiry: null] . Illegal path attribute  /nexus . Path of origin:  /snapshot_repository/fr/paris/lutece/lutece-core/maven-metadata.xml.sha1 

                     
Downloaded: http://dev.lutece.paris.fr/snapshot_repository/fr/paris/lutece/lutece-core/maven-metadata.xml (853 B at 3.7 KB/sec)
mars 10, 2014 11:02:15 AM org.apache.maven.wagon.providers.http.httpclient.client.protocol.ResponseProcessCookies processCookies
WARNING: Cookie rejected:  [version: 0][name: JSESSIONID][value: 47EA6840459ADCFFB845DA7ADA66242B][domain: dev.lutece.paris.fr][path: /nexus][expiry: null] . Illegal path attribute  /nexus . Path of origin:  /maven_repository/fr/paris/lutece/lutece-core/maven-metadata.xml.sha1 
                     
Downloaded: http://dev.lutece.paris.fr/maven_repository/fr/paris/lutece/lutece-core/maven-metadata.xml (3 KB at 7.4 KB/sec)
Downloading: http://dev.lutece.paris.fr/maven_repository/opensymphony/quartz/1.6.0/quartz-1.6.0.pom
mars 10, 2014 11:02:15 AM org.apache.maven.wagon.providers.http.httpclient.client.protocol.ResponseProcessCookies processCookies
WARNING: Cookie rejected:  [version: 0][name: JSESSIONID][value: FE39B0A0A75633E4C6505EB3446DDBAF][domain: dev.lutece.paris.fr][path: /nexus][expiry: null] . Illegal path attribute  /nexus . Path of origin:  /maven_repository/opensymphony/quartz/1.6.0/quartz-1.6.0.pom 
                     
Downloading: http://repo.maven.apache.org/maven2/opensymphony/quartz/1.6.0/quartz-1.6.0.pom
                     
[WARNING] The POM for opensymphony:quartz:jar:1.6.0 is missing, no dependency information available
Downloading: http://dev.lutece.paris.fr/maven_repository/fr/paris/lutece/plugins/library-lucene/maven-metadata.xml
Downloading: http://dev.lutece.paris.fr/snapshot_repository/fr/paris/lutece/plugins/library-lucene/maven-metadata.xml
Downloading: http://repo.maven.apache.org/maven2/fr/paris/lutece/plugins/library-lucene/maven-metadata.xml
499/499 B            mars 10, 2014 11:02:15 AM org.apache.maven.wagon.providers.http.httpclient.client.protocol.ResponseProcessCookies processCookies
WARNING: Cookie rejected:  [version: 0][name: JSESSIONID][value: 3953913DA80E2D76572896608D367745][domain: dev.lutece.paris.fr][path: /nexus][expiry: null] . Illegal path attribute  /nexus . Path of origin:  /maven_repository/fr/paris/lutece/plugins/library-lucene/maven-metadata.xml 

            mars 10, 2014 11:02:16 AM org.apache.maven.wagon.providers.http.httpclient.client.protocol.ResponseProcessCookies processCookies
WARNING: Cookie rejected:  [version: 0][name: JSESSIONID][value: 091A96A9250ADC7D8F40C3C6884AF9BE][domain: dev.lutece.paris.fr][path: /nexus][expiry: null] . Illegal path attribute  /nexus . Path of origin:  /snapshot_repository/fr/paris/lutece/plugins/library-lucene/maven-metadata.xml 

499/499 B   333/333 B   mars 10, 2014 11:02:16 AM org.apache.maven.wagon.providers.http.httpclient.client.protocol.ResponseProcessCookies processCookies
WARNING: Cookie rejected:  [version: 0][name: JSESSIONID][value: 6835019BF00CF9C3ECF5011CD7DF2346][domain: dev.lutece.paris.fr][path: /nexus][expiry: null] . Illegal path attribute  /nexus . Path of origin:  /maven_repository/fr/paris/lutece/plugins/library-lucene/maven-metadata.xml.sha1 

                        
Downloaded: http://dev.lutece.paris.fr/maven_repository/fr/paris/lutece/plugins/library-lucene/maven-metadata.xml (499 B at 1.9 KB/sec)
mars 10, 2014 11:02:16 AM org.apache.maven.wagon.providers.http.httpclient.client.protocol.ResponseProcessCookies processCookies
WARNING: Cookie rejected:  [version: 0][name: JSESSIONID][value: DCEF3B545AEF29ACEF78BA6C430ACC91][domain: dev.lutece.paris.fr][path: /nexus][expiry: null] . Illegal path attribute  /nexus . Path of origin:  /snapshot_repository/fr/paris/lutece/plugins/library-lucene/maven-metadata.xml.sha1 
                        
Downloaded: http://dev.lutece.paris.fr/snapshot_repository/fr/paris/lutece/plugins/library-lucene/maven-metadata.xml (333 B at 0.9 KB/sec)
Downloading: http://dev.lutece.paris.fr/maven_repository/fr/paris/lutece/plugins/library-lucene/1.0.6-SNAPSHOT/maven-metadata.xml
Downloading: http://dev.lutece.paris.fr/snapshot_repository/fr/paris/lutece/plugins/library-lucene/1.0.6-SNAPSHOT/maven-metadata.xml
mars 10, 2014 11:02:16 AM org.apache.maven.wagon.providers.http.httpclient.client.protocol.ResponseProcessCookies processCookies
WARNING: Cookie rejected:  [version: 0][name: JSESSIONID][value: CDF8A6023F48E195BFFBC3B15BAB29A2][domain: dev.lutece.paris.fr][path: /nexus][expiry: null] . Illegal path attribute  /nexus . Path of origin:  /maven_repository/fr/paris/lutece/plugins/library-lucene/1.0.6-SNAPSHOT/maven-metadata.xml 
                        mars 10, 2014 11:02:16 AM org.apache.maven.wagon.providers.http.httpclient.client.protocol.ResponseProcessCookies processCookies
WARNING: Cookie rejected:  [version: 0][name: JSESSIONID][value: 78F42E54C404685EEDB65AA560B6D8B2][domain: dev.lutece.paris.fr][path: /nexus][expiry: null] . Illegal path attribute  /nexus . Path of origin:  /snapshot_repository/fr/paris/lutece/plugins/library-lucene/1.0.6-SNAPSHOT/maven-metadata.xml 

374/374 B               mars 10, 2014 11:02:16 AM org.apache.maven.wagon.providers.http.httpclient.client.protocol.ResponseProcessCookies processCookies
WARNING: Cookie rejected:  [version: 0][name: JSESSIONID][value: A57AD46FD4670B31BAEE859753466D9D][domain: dev.lutece.paris.fr][path: /nexus][expiry: null] . Illegal path attribute  /nexus . Path of origin:  /snapshot_repository/fr/paris/lutece/plugins/library-lucene/1.0.6-SNAPSHOT/maven-metadata.xml.sha1 

            
Downloaded: http://dev.lutece.paris.fr/snapshot_repository/fr/paris/lutece/plugins/library-lucene/1.0.6-SNAPSHOT/maven-metadata.xml (374 B at 0.9 KB/sec)
Downloading: http://dev.lutece.paris.fr/snapshot_repository/fr/paris/lutece/lutece-core/2.4.4-SNAPSHOT/maven-metadata.xml
Downloading: http://dev.lutece.paris.fr/maven_repository/fr/paris/lutece/lutece-core/2.4.4-SNAPSHOT/maven-metadata.xml
mars 10, 2014 11:02:17 AM org.apache.maven.wagon.providers.http.httpclient.client.protocol.ResponseProcessCookies processCookies
WARNING: Cookie rejected:  [version: 0][name: JSESSIONID][value: 9473EE04B741B16BC43A5ED33B89530D][domain: dev.lutece.paris.fr][path: /nexus][expiry: null] . Illegal path attribute  /nexus . Path of origin:  /snapshot_repository/fr/paris/lutece/lutece-core/2.4.4-SNAPSHOT/maven-metadata.xml 
363/363 B   mars 10, 2014 11:02:17 AM org.apache.maven.wagon.providers.http.httpclient.client.protocol.ResponseProcessCookies processCookies
WARNING: Cookie rejected:  [version: 0][name: JSESSIONID][value: 35BA6661F409B9963916BEBF83728596][domain: dev.lutece.paris.fr][path: /nexus][expiry: null] . Illegal path attribute  /nexus . Path of origin:  /maven_repository/fr/paris/lutece/lutece-core/2.4.4-SNAPSHOT/maven-metadata.xml 

            mars 10, 2014 11:02:17 AM org.apache.maven.wagon.providers.http.httpclient.client.protocol.ResponseProcessCookies processCookies
WARNING: Cookie rejected:  [version: 0][name: JSESSIONID][value: 01756B9BE512B8AD28345C25612AF667][domain: dev.lutece.paris.fr][path: /nexus][expiry: null] . Illegal path attribute  /nexus . Path of origin:  /snapshot_repository/fr/paris/lutece/lutece-core/2.4.4-SNAPSHOT/maven-metadata.xml.sha1 

            
Downloaded: http://dev.lutece.paris.fr/snapshot_repository/fr/paris/lutece/lutece-core/2.4.4-SNAPSHOT/maven-metadata.xml (363 B at 1.6 KB/sec)
Downloading: http://dev.lutece.paris.fr/maven_repository/fr/paris/lutece/lutece-core/2.5.0-SNAPSHOT/maven-metadata.xml
Downloading: http://dev.lutece.paris.fr/snapshot_repository/fr/paris/lutece/lutece-core/2.5.0-SNAPSHOT/maven-metadata.xml
mars 10, 2014 11:02:17 AM org.apache.maven.wagon.providers.http.httpclient.client.protocol.ResponseProcessCookies processCookies
WARNING: Cookie rejected:  [version: 0][name: JSESSIONID][value: 756BCB7D5BCB47F4383543CEA871868C][domain: dev.lutece.paris.fr][path: /nexus][expiry: null] . Illegal path attribute  /nexus . Path of origin:  /maven_repository/fr/paris/lutece/lutece-core/2.5.0-SNAPSHOT/maven-metadata.xml 
            mars 10, 2014 11:02:17 AM org.apache.maven.wagon.providers.http.httpclient.client.protocol.ResponseProcessCookies processCookies
WARNING: Cookie rejected:  [version: 0][name: JSESSIONID][value: 35C5C1EED3F22B371E684ADA16E1776D][domain: dev.lutece.paris.fr][path: /nexus][expiry: null] . Illegal path attribute  /nexus . Path of origin:  /snapshot_repository/fr/paris/lutece/lutece-core/2.5.0-SNAPSHOT/maven-metadata.xml 

362/362 B   mars 10, 2014 11:02:17 AM org.apache.maven.wagon.providers.http.httpclient.client.protocol.ResponseProcessCookies processCookies
WARNING: Cookie rejected:  [version: 0][name: JSESSIONID][value: 2FB72B8BC6FEB26E9C2779D126D66630][domain: dev.lutece.paris.fr][path: /nexus][expiry: null] . Illegal path attribute  /nexus . Path of origin:  /snapshot_repository/fr/paris/lutece/lutece-core/2.5.0-SNAPSHOT/maven-metadata.xml.sha1 

            
Downloaded: http://dev.lutece.paris.fr/snapshot_repository/fr/paris/lutece/lutece-core/2.5.0-SNAPSHOT/maven-metadata.xml (362 B at 0.9 KB/sec)
Downloading: http://dev.lutece.paris.fr/maven_repository/fr/paris/lutece/lutece-core/3.0.10-SNAPSHOT/maven-metadata.xml
Downloading: http://dev.lutece.paris.fr/snapshot_repository/fr/paris/lutece/lutece-core/3.0.10-SNAPSHOT/maven-metadata.xml
mars 10, 2014 11:02:17 AM org.apache.maven.wagon.providers.http.httpclient.client.protocol.ResponseProcessCookies processCookies
WARNING: Cookie rejected:  [version: 0][name: JSESSIONID][value: CB7D64D47F1ACC77A3C6AA4F59E08D41][domain: dev.lutece.paris.fr][path: /nexus][expiry: null] . Illegal path attribute  /nexus . Path of origin:  /maven_repository/fr/paris/lutece/lutece-core/3.0.10-SNAPSHOT/maven-metadata.xml 
            mars 10, 2014 11:02:17 AM org.apache.maven.wagon.providers.http.httpclient.client.protocol.ResponseProcessCookies processCookies
WARNING: Cookie rejected:  [version: 0][name: JSESSIONID][value: 69DE4029F15C79794EA0F53150C7C644][domain: dev.lutece.paris.fr][path: /nexus][expiry: null] . Illegal path attribute  /nexus . Path of origin:  /snapshot_repository/fr/paris/lutece/lutece-core/3.0.10-SNAPSHOT/maven-metadata.xml 

363/363 B   mars 10, 2014 11:02:18 AM org.apache.maven.wagon.providers.http.httpclient.client.protocol.ResponseProcessCookies processCookies
WARNING: Cookie rejected:  [version: 0][name: JSESSIONID][value: 4012C17610E4C226BA9324C387457F6B][domain: dev.lutece.paris.fr][path: /nexus][expiry: null] . Illegal path attribute  /nexus . Path of origin:  /snapshot_repository/fr/paris/lutece/lutece-core/3.0.10-SNAPSHOT/maven-metadata.xml.sha1 

            
Downloaded: http://dev.lutece.paris.fr/snapshot_repository/fr/paris/lutece/lutece-core/3.0.10-SNAPSHOT/maven-metadata.xml (363 B at 1.2 KB/sec)
Downloading: http://dev.lutece.paris.fr/snapshot_repository/fr/paris/lutece/plugins/library-rbac-api/1.0.0-SNAPSHOT/maven-metadata.xml
Downloading: http://dev.lutece.paris.fr/maven_repository/fr/paris/lutece/plugins/library-rbac-api/1.0.0-SNAPSHOT/maven-metadata.xml
mars 10, 2014 11:02:18 AM org.apache.maven.wagon.providers.http.httpclient.client.protocol.ResponseProcessCookies processCookies
WARNING: Cookie rejected:  [version: 0][name: JSESSIONID][value: 63F0D9060A580E5AB790F061B1603184][domain: dev.lutece.paris.fr][path: /nexus][expiry: null] . Illegal path attribute  /nexus . Path of origin:  /snapshot_repository/fr/paris/lutece/plugins/library-rbac-api/1.0.0-SNAPSHOT/maven-metadata.xml 
            mars 10, 2014 11:02:18 AM org.apache.maven.wagon.providers.http.httpclient.client.protocol.ResponseProcessCookies processCookies
WARNING: Cookie rejected:  [version: 0][name: JSESSIONID][value: DDECE0C60DB7B422209DA6C5764A6DF1][domain: dev.lutece.paris.fr][path: /nexus][expiry: null] . Illegal path attribute  /nexus . Path of origin:  /maven_repository/fr/paris/lutece/plugins/library-rbac-api/1.0.0-SNAPSHOT/maven-metadata.xml 

            
Downloading: http://dev.lutece.paris.fr/maven_repository/fr/paris/lutece/plugins/library-rbac-api/1.0.0-SNAPSHOT/library-rbac-api-1.0.0-SNAPSHOT.pom
mars 10, 2014 11:02:18 AM org.apache.maven.wagon.providers.http.httpclient.client.protocol.ResponseProcessCookies processCookies
WARNING: Cookie rejected:  [version: 0][name: JSESSIONID][value: DED100895F275CFB8C7BE55F4382C76F][domain: dev.lutece.paris.fr][path: /nexus][expiry: null] . Illegal path attribute  /nexus . Path of origin:  /maven_repository/fr/paris/lutece/plugins/library-rbac-api/1.0.0-SNAPSHOT/library-rbac-api-1.0.0-SNAPSHOT.pom 
            
Downloading: http://dev.lutece.paris.fr/snapshot_repository/fr/paris/lutece/plugins/library-rbac-api/1.0.0-SNAPSHOT/library-rbac-api-1.0.0-SNAPSHOT.pom
mars 10, 2014 11:02:18 AM org.apache.maven.wagon.providers.http.httpclient.client.protocol.ResponseProcessCookies processCookies
WARNING: Cookie rejected:  [version: 0][name: JSESSIONID][value: 32E8E0B8863C8D3BBDD5A5FD2262DCA0][domain: dev.lutece.paris.fr][path: /nexus][expiry: null] . Illegal path attribute  /nexus . Path of origin:  /snapshot_repository/fr/paris/lutece/plugins/library-rbac-api/1.0.0-SNAPSHOT/library-rbac-api-1.0.0-SNAPSHOT.pom 
            
[WARNING] The POM for fr.paris.lutece.plugins:library-rbac-api:jar:1.0.0-SNAPSHOT is missing, no dependency information available
Downloading: http://dev.lutece.paris.fr/snapshot_repository/fr/paris/lutece/plugins/library-workgroup-api/1.0.0-SNAPSHOT/maven-metadata.xml
Downloading: http://dev.lutece.paris.fr/maven_repository/fr/paris/lutece/plugins/library-workgroup-api/1.0.0-SNAPSHOT/maven-metadata.xml
mars 10, 2014 11:02:18 AM org.apache.maven.wagon.providers.http.httpclient.client.protocol.ResponseProcessCookies processCookies
WARNING: Cookie rejected:  [version: 0][name: JSESSIONID][value: 5DF958DAE21A58347889B0C12BFCDBBF][domain: dev.lutece.paris.fr][path: /nexus][expiry: null] . Illegal path attribute  /nexus . Path of origin:  /maven_repository/fr/paris/lutece/plugins/library-workgroup-api/1.0.0-SNAPSHOT/maven-metadata.xml 
            
            mars 10, 2014 11:02:18 AM org.apache.maven.wagon.providers.http.httpclient.client.protocol.ResponseProcessCookies processCookies
WARNING: Cookie rejected:  [version: 0][name: JSESSIONID][value: 3E89409F693283A95E9418CDFE245A3F][domain: dev.lutece.paris.fr][path: /nexus][expiry: null] . Illegal path attribute  /nexus . Path of origin:  /snapshot_repository/fr/paris/lutece/plugins/library-workgroup-api/1.0.0-SNAPSHOT/maven-metadata.xml 

Downloading: http://dev.lutece.paris.fr/maven_repository/fr/paris/lutece/plugins/library-workgroup-api/1.0.0-SNAPSHOT/library-workgroup-api-1.0.0-SNAPSHOT.pom
mars 10, 2014 11:02:19 AM org.apache.maven.wagon.providers.http.httpclient.client.protocol.ResponseProcessCookies processCookies
WARNING: Cookie rejected:  [version: 0][name: JSESSIONID][value: 84766F8973FC7FFC7D4845C46D9199ED][domain: dev.lutece.paris.fr][path: /nexus][expiry: null] . Illegal path attribute  /nexus . Path of origin:  /maven_repository/fr/paris/lutece/plugins/library-workgroup-api/1.0.0-SNAPSHOT/library-workgroup-api-1.0.0-SNAPSHOT.pom 
            
Downloading: http://dev.lutece.paris.fr/snapshot_repository/fr/paris/lutece/plugins/library-workgroup-api/1.0.0-SNAPSHOT/library-workgroup-api-1.0.0-SNAPSHOT.pom
mars 10, 2014 11:02:19 AM org.apache.maven.wagon.providers.http.httpclient.client.protocol.ResponseProcessCookies processCookies
WARNING: Cookie rejected:  [version: 0][name: JSESSIONID][value: BAB3797E1EEE856FC04611D77C419FAF][domain: dev.lutece.paris.fr][path: /nexus][expiry: null] . Illegal path attribute  /nexus . Path of origin:  /snapshot_repository/fr/paris/lutece/plugins/library-workgroup-api/1.0.0-SNAPSHOT/library-workgroup-api-1.0.0-SNAPSHOT.pom 
            
[WARNING] The POM for fr.paris.lutece.plugins:library-workgroup-api:jar:1.0.0-SNAPSHOT is missing, no dependency information available
Downloading: http://dev.lutece.paris.fr/snapshot_repository/fr/paris/lutece/plugins/library-freemarker/1.0.0-SNAPSHOT/maven-metadata.xml
Downloading: http://dev.lutece.paris.fr/maven_repository/fr/paris/lutece/plugins/library-freemarker/1.0.0-SNAPSHOT/maven-metadata.xml
mars 10, 2014 11:02:19 AM org.apache.maven.wagon.providers.http.httpclient.client.protocol.ResponseProcessCookies processCookies
WARNING: Cookie rejected:  [version: 0][name: JSESSIONID][value: 93A8E093E7B92591EC4DE366A5FC7293][domain: dev.lutece.paris.fr][path: /nexus][expiry: null] . Illegal path attribute  /nexus . Path of origin:  /snapshot_repository/fr/paris/lutece/plugins/library-freemarker/1.0.0-SNAPSHOT/maven-metadata.xml 
mars 10, 2014 11:02:19 AM org.apache.maven.wagon.providers.http.httpclient.client.protocol.ResponseProcessCookies processCookies
WARNING: Cookie rejected:  [version: 0][name: JSESSIONID][value: 94CEEDDC2D88973C31EB2D338BE91C80][domain: dev.lutece.paris.fr][path: /nexus][expiry: null] . Illegal path attribute  /nexus . Path of origin:  /maven_repository/fr/paris/lutece/plugins/library-freemarker/1.0.0-SNAPSHOT/maven-metadata.xml 
            
            
Downloading: http://dev.lutece.paris.fr/maven_repository/fr/paris/lutece/plugins/library-freemarker/1.0.0-SNAPSHOT/library-freemarker-1.0.0-SNAPSHOT.pom
mars 10, 2014 11:02:19 AM org.apache.maven.wagon.providers.http.httpclient.client.protocol.ResponseProcessCookies processCookies
WARNING: Cookie rejected:  [version: 0][name: JSESSIONID][value: 8E8A3ADA6F0B6FBDD1F165E7962652AB][domain: dev.lutece.paris.fr][path: /nexus][expiry: null] . Illegal path attribute  /nexus . Path of origin:  /maven_repository/fr/paris/lutece/plugins/library-freemarker/1.0.0-SNAPSHOT/library-freemarker-1.0.0-SNAPSHOT.pom 
            
Downloading: http://dev.lutece.paris.fr/snapshot_repository/fr/paris/lutece/plugins/library-freemarker/1.0.0-SNAPSHOT/library-freemarker-1.0.0-SNAPSHOT.pom
            mars 10, 2014 11:02:20 AM org.apache.maven.wagon.providers.http.httpclient.client.protocol.ResponseProcessCookies processCookies
WARNING: Cookie rejected:  [version: 0][name: JSESSIONID][value: 15E7F924D137576EBB94C0A5AEE9F648][domain: dev.lutece.paris.fr][path: /nexus][expiry: null] . Illegal path attribute  /nexus . Path of origin:  /snapshot_repository/fr/paris/lutece/plugins/library-freemarker/1.0.0-SNAPSHOT/library-freemarker-1.0.0-SNAPSHOT.pom 

[WARNING] The POM for fr.paris.lutece.plugins:library-freemarker:jar:1.0.0-SNAPSHOT is missing, no dependency information available
Downloading: http://dev.lutece.paris.fr/maven_repository/fr/paris/lutece/plugins/library-workflow-core/1.0.0-SNAPSHOT/maven-metadata.xml
Downloading: http://dev.lutece.paris.fr/snapshot_repository/fr/paris/lutece/plugins/library-workflow-core/1.0.0-SNAPSHOT/maven-metadata.xml
mars 10, 2014 11:02:20 AM org.apache.maven.wagon.providers.http.httpclient.client.protocol.ResponseProcessCookies processCookies
WARNING: Cookie rejected:  [version: 0][name: JSESSIONID][value: 11458DB5C8556D074195D81B10BD1D63][domain: dev.lutece.paris.fr][path: /nexus][expiry: null] . Illegal path attribute  /nexus . Path of origin:  /snapshot_repository/fr/paris/lutece/plugins/library-workflow-core/1.0.0-SNAPSHOT/maven-metadata.xml 
            mars 10, 2014 11:02:20 AM org.apache.maven.wagon.providers.http.httpclient.client.protocol.ResponseProcessCookies processCookies
WARNING: Cookie rejected:  [version: 0][name: JSESSIONID][value: B8E3898668248DB136C4562D8D5D9FB7][domain: dev.lutece.paris.fr][path: /nexus][expiry: null] . Illegal path attribute  /nexus . Path of origin:  /maven_repository/fr/paris/lutece/plugins/library-workflow-core/1.0.0-SNAPSHOT/maven-metadata.xml 

            
Downloading: http://dev.lutece.paris.fr/maven_repository/fr/paris/lutece/plugins/library-workflow-core/1.0.0-SNAPSHOT/library-workflow-core-1.0.0-SNAPSHOT.pom
mars 10, 2014 11:02:20 AM org.apache.maven.wagon.providers.http.httpclient.client.protocol.ResponseProcessCookies processCookies
WARNING: Cookie rejected:  [version: 0][name: JSESSIONID][value: 0750CFA533963ED52A850F586FF5A21F][domain: dev.lutece.paris.fr][path: /nexus][expiry: null] . Illegal path attribute  /nexus . Path of origin:  /maven_repository/fr/paris/lutece/plugins/library-workflow-core/1.0.0-SNAPSHOT/library-workflow-core-1.0.0-SNAPSHOT.pom 
            
Downloading: http://dev.lutece.paris.fr/snapshot_repository/fr/paris/lutece/plugins/library-workflow-core/1.0.0-SNAPSHOT/library-workflow-core-1.0.0-SNAPSHOT.pom
mars 10, 2014 11:02:21 AM org.apache.maven.wagon.providers.http.httpclient.client.protocol.ResponseProcessCookies processCookies
WARNING: Cookie rejected:  [version: 0][name: JSESSIONID][value: BEA05228C1541CDABE9D5151FCE5F832][domain: dev.lutece.paris.fr][path: /nexus][expiry: null] . Illegal path attribute  /nexus . Path of origin:  /snapshot_repository/fr/paris/lutece/plugins/library-workflow-core/1.0.0-SNAPSHOT/library-workflow-core-1.0.0-SNAPSHOT.pom 
            
[WARNING] The POM for fr.paris.lutece.plugins:library-workflow-core:jar:1.0.0-SNAPSHOT is missing, no dependency information available
Downloading: http://dev.lutece.paris.fr/maven_repository/fr/paris/lutece/lutece-core/3.1.8-SNAPSHOT/maven-metadata.xml
Downloading: http://dev.lutece.paris.fr/snapshot_repository/fr/paris/lutece/lutece-core/3.1.8-SNAPSHOT/maven-metadata.xml
mars 10, 2014 11:02:21 AM org.apache.maven.wagon.providers.http.httpclient.client.protocol.ResponseProcessCookies processCookies
WARNING: Cookie rejected:  [version: 0][name: JSESSIONID][value: 5C424373DA8D319D99ADEAC9CE6781DA][domain: dev.lutece.paris.fr][path: /nexus][expiry: null] . Illegal path attribute  /nexus . Path of origin:  /maven_repository/fr/paris/lutece/lutece-core/3.1.8-SNAPSHOT/maven-metadata.xml 
            mars 10, 2014 11:02:21 AM org.apache.maven.wagon.providers.http.httpclient.client.protocol.ResponseProcessCookies processCookies
WARNING: Cookie rejected:  [version: 0][name: JSESSIONID][value: 23B87404184E5445E93CC7BFA61882B9][domain: dev.lutece.paris.fr][path: /nexus][expiry: null] . Illegal path attribute  /nexus . Path of origin:  /snapshot_repository/fr/paris/lutece/lutece-core/3.1.8-SNAPSHOT/maven-metadata.xml 

362/362 B   mars 10, 2014 11:02:21 AM org.apache.maven.wagon.providers.http.httpclient.client.protocol.ResponseProcessCookies processCookies
WARNING: Cookie rejected:  [version: 0][name: JSESSIONID][value: 9AF877B26B2A8E7244759157B1F8FB3C][domain: dev.lutece.paris.fr][path: /nexus][expiry: null] . Illegal path attribute  /nexus . Path of origin:  /snapshot_repository/fr/paris/lutece/lutece-core/3.1.8-SNAPSHOT/maven-metadata.xml.sha1 

            
Downloaded: http://dev.lutece.paris.fr/snapshot_repository/fr/paris/lutece/lutece-core/3.1.8-SNAPSHOT/maven-metadata.xml (362 B at 0.9 KB/sec)
Downloading: http://dev.lutece.paris.fr/maven_repository/fr/paris/lutece/plugins/plugin-newsletter/2.2.10-SNAPSHOT/maven-metadata.xml
Downloading: http://dev.lutece.paris.fr/snapshot_repository/fr/paris/lutece/plugins/plugin-newsletter/2.2.10-SNAPSHOT/maven-metadata.xml
mars 10, 2014 11:02:21 AM org.apache.maven.wagon.providers.http.httpclient.client.protocol.ResponseProcessCookies processCookies
WARNING: Cookie rejected:  [version: 0][name: JSESSIONID][value: 4BDBF0130C8D27B5F15EEAD883EA329C][domain: dev.lutece.paris.fr][path: /nexus][expiry: null] . Illegal path attribute  /nexus . Path of origin:  /snapshot_repository/fr/paris/lutece/plugins/plugin-newsletter/2.2.10-SNAPSHOT/maven-metadata.xml 
378/378 B   mars 10, 2014 11:02:21 AM org.apache.maven.wagon.providers.http.httpclient.client.protocol.ResponseProcessCookies processCookies
WARNING: Cookie rejected:  [version: 0][name: JSESSIONID][value: C1C7203CFF89077320D39D64E818222A][domain: dev.lutece.paris.fr][path: /nexus][expiry: null] . Illegal path attribute  /nexus . Path of origin:  /maven_repository/fr/paris/lutece/plugins/plugin-newsletter/2.2.10-SNAPSHOT/maven-metadata.xml 

            
            
Downloaded: http://dev.lutece.paris.fr/snapshot_repository/fr/paris/lutece/plugins/plugin-newsletter/2.2.10-SNAPSHOT/maven-metadata.xml (378 B at 1.6 KB/sec)
mars 10, 2014 11:02:22 AM org.apache.maven.wagon.providers.http.httpclient.client.protocol.ResponseProcessCookies processCookies
WARNING: Cookie rejected:  [version: 0][name: JSESSIONID][value: 7E6F144BA5BCCD41EDE6621E08F0FE79][domain: dev.lutece.paris.fr][path: /nexus][expiry: null] . Illegal path attribute  /nexus . Path of origin:  /snapshot_repository/fr/paris/lutece/plugins/plugin-newsletter/2.2.10-SNAPSHOT/maven-metadata.xml.sha1 
Downloading: http://dev.lutece.paris.fr/snapshot_repository/fr/paris/lutece/lutece-core/4.1.2-SNAPSHOT/maven-metadata.xml
Downloading: http://dev.lutece.paris.fr/maven_repository/fr/paris/lutece/lutece-core/4.1.2-SNAPSHOT/maven-metadata.xml
mars 10, 2014 11:02:22 AM org.apache.maven.wagon.providers.http.httpclient.client.protocol.ResponseProcessCookies processCookies
WARNING: Cookie rejected:  [version: 0][name: JSESSIONID][value: 9ED175F8EF706CE7B999C80A4EA41660][domain: dev.lutece.paris.fr][path: /nexus][expiry: null] . Illegal path attribute  /nexus . Path of origin:  /snapshot_repository/fr/paris/lutece/lutece-core/4.1.2-SNAPSHOT/maven-metadata.xml 
363/363 B   mars 10, 2014 11:02:22 AM org.apache.maven.wagon.providers.http.httpclient.client.protocol.ResponseProcessCookies processCookies
WARNING: Cookie rejected:  [version: 0][name: JSESSIONID][value: 71CD3A16080A02C064496CA125718842][domain: dev.lutece.paris.fr][path: /nexus][expiry: null] . Illegal path attribute  /nexus . Path of origin:  /maven_repository/fr/paris/lutece/lutece-core/4.1.2-SNAPSHOT/maven-metadata.xml 

            mars 10, 2014 11:02:22 AM org.apache.maven.wagon.providers.http.httpclient.client.protocol.ResponseProcessCookies processCookies
WARNING: Cookie rejected:  [version: 0][name: JSESSIONID][value: BE5CEEBA3EF9B598DCF9A6574B9E18FA][domain: dev.lutece.paris.fr][path: /nexus][expiry: null] . Illegal path attribute  /nexus . Path of origin:  /snapshot_repository/fr/paris/lutece/lutece-core/4.1.2-SNAPSHOT/maven-metadata.xml.sha1 

            
Downloaded: http://dev.lutece.paris.fr/snapshot_repository/fr/paris/lutece/lutece-core/4.1.2-SNAPSHOT/maven-metadata.xml (363 B at 1.5 KB/sec)
Downloading: http://dev.lutece.paris.fr/snapshot_repository/fr/paris/lutece/lutece-core/4.2.1-SNAPSHOT/maven-metadata.xml
Downloading: http://dev.lutece.paris.fr/maven_repository/fr/paris/lutece/lutece-core/4.2.1-SNAPSHOT/maven-metadata.xml
mars 10, 2014 11:02:22 AM org.apache.maven.wagon.providers.http.httpclient.client.protocol.ResponseProcessCookies processCookies
WARNING: Cookie rejected:  [version: 0][name: JSESSIONID][value: DAFD151FEF7A752A6FFE9176A585CB3D][domain: dev.lutece.paris.fr][path: /nexus][expiry: null] . Illegal path attribute  /nexus . Path of origin:  /snapshot_repository/fr/paris/lutece/lutece-core/4.2.1-SNAPSHOT/maven-metadata.xml 
362/362 B   mars 10, 2014 11:02:22 AM org.apache.maven.wagon.providers.http.httpclient.client.protocol.ResponseProcessCookies processCookies
WARNING: Cookie rejected:  [version: 0][name: JSESSIONID][value: D50A262CB1D5945F5D482B2C28E17127][domain: dev.lutece.paris.fr][path: /nexus][expiry: null] . Illegal path attribute  /nexus . Path of origin:  /maven_repository/fr/paris/lutece/lutece-core/4.2.1-SNAPSHOT/maven-metadata.xml 

            mars 10, 2014 11:02:22 AM org.apache.maven.wagon.providers.http.httpclient.client.protocol.ResponseProcessCookies processCookies
WARNING: Cookie rejected:  [version: 0][name: JSESSIONID][value: E00CFD8655C4994986DBDC25FE12DFD0][domain: dev.lutece.paris.fr][path: /nexus][expiry: null] . Illegal path attribute  /nexus . Path of origin:  /snapshot_repository/fr/paris/lutece/lutece-core/4.2.1-SNAPSHOT/maven-metadata.xml.sha1 

            
Downloaded: http://dev.lutece.paris.fr/snapshot_repository/fr/paris/lutece/lutece-core/4.2.1-SNAPSHOT/maven-metadata.xml (362 B at 1.7 KB/sec)
Downloading: http://dev.lutece.paris.fr/maven_repository/fr/paris/lutece/lutece-core/4.3.1-SNAPSHOT/maven-metadata.xml
Downloading: http://dev.lutece.paris.fr/snapshot_repository/fr/paris/lutece/lutece-core/4.3.1-SNAPSHOT/maven-metadata.xml
mars 10, 2014 11:02:22 AM org.apache.maven.wagon.providers.http.httpclient.client.protocol.ResponseProcessCookies processCookies
WARNING: Cookie rejected:  [version: 0][name: JSESSIONID][value: 1CA7A930A36B12B2233FD2A0EDA7AC89][domain: dev.lutece.paris.fr][path: /nexus][expiry: null] . Illegal path attribute  /nexus . Path of origin:  /maven_repository/fr/paris/lutece/lutece-core/4.3.1-SNAPSHOT/maven-metadata.xml 
            mars 10, 2014 11:02:22 AM org.apache.maven.wagon.providers.http.httpclient.client.protocol.ResponseProcessCookies processCookies
WARNING: Cookie rejected:  [version: 0][name: JSESSIONID][value: E6C0844D7DEBF09CB36686EA1C164250][domain: dev.lutece.paris.fr][path: /nexus][expiry: null] . Illegal path attribute  /nexus . Path of origin:  /snapshot_repository/fr/paris/lutece/lutece-core/4.3.1-SNAPSHOT/maven-metadata.xml 

362/362 B   mars 10, 2014 11:02:22 AM org.apache.maven.wagon.providers.http.httpclient.client.protocol.ResponseProcessCookies processCookies
WARNING: Cookie rejected:  [version: 0][name: JSESSIONID][value: 79F2F1209B2A825B11188251DBD4156F][domain: dev.lutece.paris.fr][path: /nexus][expiry: null] . Illegal path attribute  /nexus . Path of origin:  /snapshot_repository/fr/paris/lutece/lutece-core/4.3.1-SNAPSHOT/maven-metadata.xml.sha1 

            
Downloaded: http://dev.lutece.paris.fr/snapshot_repository/fr/paris/lutece/lutece-core/4.3.1-SNAPSHOT/maven-metadata.xml (362 B at 1.2 KB/sec)
Downloading: http://dev.lutece.paris.fr/maven_repository/fr/paris/lutece/lutece-core/5.0.0-SNAPSHOT/maven-metadata.xml
Downloading: http://dev.lutece.paris.fr/snapshot_repository/fr/paris/lutece/lutece-core/5.0.0-SNAPSHOT/maven-metadata.xml
mars 10, 2014 11:02:23 AM org.apache.maven.wagon.providers.http.httpclient.client.protocol.ResponseProcessCookies processCookies
WARNING: Cookie rejected:  [version: 0][name: JSESSIONID][value: 00E559669BF2D778AA8DAA7D5EECAF6D][domain: dev.lutece.paris.fr][path: /nexus][expiry: null] . Illegal path attribute  /nexus . Path of origin:  /maven_repository/fr/paris/lutece/lutece-core/5.0.0-SNAPSHOT/maven-metadata.xml 
            mars 10, 2014 11:02:23 AM org.apache.maven.wagon.providers.http.httpclient.client.protocol.ResponseProcessCookies processCookies
WARNING: Cookie rejected:  [version: 0][name: JSESSIONID][value: 03E447FB9291D9272B0A8F03575DA9F0][domain: dev.lutece.paris.fr][path: /nexus][expiry: null] . Illegal path attribute  /nexus . Path of origin:  /snapshot_repository/fr/paris/lutece/lutece-core/5.0.0-SNAPSHOT/maven-metadata.xml 

362/362 B   mars 10, 2014 11:02:23 AM org.apache.maven.wagon.providers.http.httpclient.client.protocol.ResponseProcessCookies processCookies
WARNING: Cookie rejected:  [version: 0][name: JSESSIONID][value: 05AE068F1711AA8DCA5840B474185892][domain: dev.lutece.paris.fr][path: /nexus][expiry: null] . Illegal path attribute  /nexus . Path of origin:  /snapshot_repository/fr/paris/lutece/lutece-core/5.0.0-SNAPSHOT/maven-metadata.xml.sha1 

            
Downloaded: http://dev.lutece.paris.fr/snapshot_repository/fr/paris/lutece/lutece-core/5.0.0-SNAPSHOT/maven-metadata.xml (362 B at 1.1 KB/sec)
Downloading: http://dev.lutece.paris.fr/maven_repository/fr/paris/lutece/plugins/library-jmx-api/maven-metadata.xml
Downloading: http://dev.lutece.paris.fr/snapshot_repository/fr/paris/lutece/plugins/library-jmx-api/maven-metadata.xml
Downloading: http://repo.maven.apache.org/maven2/fr/paris/lutece/plugins/library-jmx-api/maven-metadata.xml
mars 10, 2014 11:02:23 AM org.apache.maven.wagon.providers.http.httpclient.client.protocol.ResponseProcessCookies processCookies
WARNING: Cookie rejected:  [version: 0][name: JSESSIONID][value: A3B183B794A0DD1261439C7503FA2499][domain: dev.lutece.paris.fr][path: /nexus][expiry: null] . Illegal path attribute  /nexus . Path of origin:  /maven_repository/fr/paris/lutece/plugins/library-jmx-api/maven-metadata.xml 
            
            mars 10, 2014 11:02:23 AM org.apache.maven.wagon.providers.http.httpclient.client.protocol.ResponseProcessCookies processCookies
WARNING: Cookie rejected:  [version: 0][name: JSESSIONID][value: A6241026262D0937E9A486ACE5AA634B][domain: dev.lutece.paris.fr][path: /nexus][expiry: null] . Illegal path attribute  /nexus . Path of origin:  /snapshot_repository/fr/paris/lutece/plugins/library-jmx-api/maven-metadata.xml 

334/334 B   mars 10, 2014 11:02:23 AM org.apache.maven.wagon.providers.http.httpclient.client.protocol.ResponseProcessCookies processCookies
WARNING: Cookie rejected:  [version: 0][name: JSESSIONID][value: 1240564E93A165B77DC01DD7E15799F5][domain: dev.lutece.paris.fr][path: /nexus][expiry: null] . Illegal path attribute  /nexus . Path of origin:  /snapshot_repository/fr/paris/lutece/plugins/library-jmx-api/maven-metadata.xml.sha1 

            
Downloaded: http://dev.lutece.paris.fr/snapshot_repository/fr/paris/lutece/plugins/library-jmx-api/maven-metadata.xml (334 B at 0.9 KB/sec)
Downloading: http://dev.lutece.paris.fr/maven_repository/fr/paris/lutece/plugins/library-jmx-api/1.0.0-SNAPSHOT/maven-metadata.xml
Downloading: http://dev.lutece.paris.fr/snapshot_repository/fr/paris/lutece/plugins/library-jmx-api/1.0.0-SNAPSHOT/maven-metadata.xml
mars 10, 2014 11:02:23 AM org.apache.maven.wagon.providers.http.httpclient.client.protocol.ResponseProcessCookies processCookies
WARNING: Cookie rejected:  [version: 0][name: JSESSIONID][value: 9E6F5466E4358F69DAF2BCF7CCF1C4E4][domain: dev.lutece.paris.fr][path: /nexus][expiry: null] . Illegal path attribute  /nexus . Path of origin:  /maven_repository/fr/paris/lutece/plugins/library-jmx-api/1.0.0-SNAPSHOT/maven-metadata.xml 
            mars 10, 2014 11:02:23 AM org.apache.maven.wagon.providers.http.httpclient.client.protocol.ResponseProcessCookies processCookies
WARNING: Cookie rejected:  [version: 0][name: JSESSIONID][value: 491B0E64024E6E68EF4B5095379D3290][domain: dev.lutece.paris.fr][path: /nexus][expiry: null] . Illegal path attribute  /nexus . Path of origin:  /snapshot_repository/fr/paris/lutece/plugins/library-jmx-api/1.0.0-SNAPSHOT/maven-metadata.xml 

374/374 B   mars 10, 2014 11:02:24 AM org.apache.maven.wagon.providers.http.httpclient.client.protocol.ResponseProcessCookies processCookies
WARNING: Cookie rejected:  [version: 0][name: JSESSIONID][value: 2405D633A42DBFCE8CF7965F7E5F9B8C][domain: dev.lutece.paris.fr][path: /nexus][expiry: null] . Illegal path attribute  /nexus . Path of origin:  /snapshot_repository/fr/paris/lutece/plugins/library-jmx-api/1.0.0-SNAPSHOT/maven-metadata.xml.sha1 

            
Downloaded: http://dev.lutece.paris.fr/snapshot_repository/fr/paris/lutece/plugins/library-jmx-api/1.0.0-SNAPSHOT/maven-metadata.xml (374 B at 1.0 KB/sec)
Downloading: http://dev.lutece.paris.fr/maven_repository/fr/paris/lutece/plugins/plugin-document/maven-metadata.xml
Downloading: http://repo.maven.apache.org/maven2/fr/paris/lutece/plugins/plugin-document/maven-metadata.xml
Downloading: http://dev.lutece.paris.fr/snapshot_repository/fr/paris/lutece/plugins/plugin-document/maven-metadata.xml
mars 10, 2014 11:02:24 AM org.apache.maven.wagon.providers.http.httpclient.client.protocol.ResponseProcessCookies processCookies
WARNING: Cookie rejected:  [version: 0][name: JSESSIONID][value: D4E49995164082982E46452FEE60DB31][domain: dev.lutece.paris.fr][path: /nexus][expiry: null] . Illegal path attribute  /nexus . Path of origin:  /snapshot_repository/fr/paris/lutece/plugins/plugin-document/maven-metadata.xml 
495/495 B   
            mars 10, 2014 11:02:24 AM org.apache.maven.wagon.providers.http.httpclient.client.protocol.ResponseProcessCookies processCookies
WARNING: Cookie rejected:  [version: 0][name: JSESSIONID][value: A343E91BFDA7F62218CD8D967F9A0F2F][domain: dev.lutece.paris.fr][path: /nexus][expiry: null] . Illegal path attribute  /nexus . Path of origin:  /maven_repository/fr/paris/lutece/plugins/plugin-document/maven-metadata.xml 

495/495 B   2/2 KB   mars 10, 2014 11:02:24 AM org.apache.maven.wagon.providers.http.httpclient.client.protocol.ResponseProcessCookies processCookies
WARNING: Cookie rejected:  [version: 0][name: JSESSIONID][value: 7B13B5CDB532CBF995758837F6955ECB][domain: dev.lutece.paris.fr][path: /nexus][expiry: null] . Illegal path attribute  /nexus . Path of origin:  /snapshot_repository/fr/paris/lutece/plugins/plugin-document/maven-metadata.xml.sha1 

                     
Downloaded: http://dev.lutece.paris.fr/snapshot_repository/fr/paris/lutece/plugins/plugin-document/maven-metadata.xml (495 B at 2.0 KB/sec)
mars 10, 2014 11:02:24 AM org.apache.maven.wagon.providers.http.httpclient.client.protocol.ResponseProcessCookies processCookies
WARNING: Cookie rejected:  [version: 0][name: JSESSIONID][value: 824179AF2A645F6645DB8CB67ADF8292][domain: dev.lutece.paris.fr][path: /nexus][expiry: null] . Illegal path attribute  /nexus . Path of origin:  /maven_repository/fr/paris/lutece/plugins/plugin-document/maven-metadata.xml.sha1 
                     
Downloaded: http://dev.lutece.paris.fr/maven_repository/fr/paris/lutece/plugins/plugin-document/maven-metadata.xml (2 KB at 4.1 KB/sec)
Downloading: http://dev.lutece.paris.fr/snapshot_repository/fr/paris/lutece/plugins/plugin-document/2.0.19-SNAPSHOT/maven-metadata.xml
Downloading: http://dev.lutece.paris.fr/maven_repository/fr/paris/lutece/plugins/plugin-document/2.0.19-SNAPSHOT/maven-metadata.xml
mars 10, 2014 11:02:24 AM org.apache.maven.wagon.providers.http.httpclient.client.protocol.ResponseProcessCookies processCookies
WARNING: Cookie rejected:  [version: 0][name: JSESSIONID][value: 709D9DDB10D8DDCB0437B6F9014DCE49][domain: dev.lutece.paris.fr][path: /nexus][expiry: null] . Illegal path attribute  /nexus . Path of origin:  /maven_repository/fr/paris/lutece/plugins/plugin-document/2.0.19-SNAPSHOT/maven-metadata.xml 
                     mars 10, 2014 11:02:24 AM org.apache.maven.wagon.providers.http.httpclient.client.protocol.ResponseProcessCookies processCookies
WARNING: Cookie rejected:  [version: 0][name: JSESSIONID][value: CD9FFAB3DA5A5B8DED4059A0C171438D][domain: dev.lutece.paris.fr][path: /nexus][expiry: null] . Illegal path attribute  /nexus . Path of origin:  /snapshot_repository/fr/paris/lutece/plugins/plugin-document/2.0.19-SNAPSHOT/maven-metadata.xml 

376/376 B            mars 10, 2014 11:02:24 AM org.apache.maven.wagon.providers.http.httpclient.client.protocol.ResponseProcessCookies processCookies
WARNING: Cookie rejected:  [version: 0][name: JSESSIONID][value: 300993B9614F4EB71C1D75678DB90140][domain: dev.lutece.paris.fr][path: /nexus][expiry: null] . Illegal path attribute  /nexus . Path of origin:  /snapshot_repository/fr/paris/lutece/plugins/plugin-document/2.0.19-SNAPSHOT/maven-metadata.xml.sha1 

            
Downloaded: http://dev.lutece.paris.fr/snapshot_repository/fr/paris/lutece/plugins/plugin-document/2.0.19-SNAPSHOT/maven-metadata.xml (376 B at 1.6 KB/sec)
Downloading: http://dev.lutece.paris.fr/snapshot_repository/fr/paris/lutece/plugins/library-indexer/maven-metadata.xml
Downloading: http://dev.lutece.paris.fr/maven_repository/fr/paris/lutece/plugins/library-indexer/maven-metadata.xml
Downloading: http://repo.maven.apache.org/maven2/fr/paris/lutece/plugins/library-indexer/maven-metadata.xml
mars 10, 2014 11:02:24 AM org.apache.maven.wagon.providers.http.httpclient.client.protocol.ResponseProcessCookies processCookies
WARNING: Cookie rejected:  [version: 0][name: JSESSIONID][value: 7474AD1FA30EFA502A4F0D1A5BFE5720][domain: dev.lutece.paris.fr][path: /nexus][expiry: null] . Illegal path attribute  /nexus . Path of origin:  /snapshot_repository/fr/paris/lutece/plugins/library-indexer/maven-metadata.xml 
532/532 B   
            mars 10, 2014 11:02:25 AM org.apache.maven.wagon.providers.http.httpclient.client.protocol.ResponseProcessCookies processCookies
WARNING: Cookie rejected:  [version: 0][name: JSESSIONID][value: 5A907E2450CE49A5A1954BE73CFB5349][domain: dev.lutece.paris.fr][path: /nexus][expiry: null] . Illegal path attribute  /nexus . Path of origin:  /maven_repository/fr/paris/lutece/plugins/library-indexer/maven-metadata.xml 

532/532 B   658/658 B   mars 10, 2014 11:02:25 AM org.apache.maven.wagon.providers.http.httpclient.client.protocol.ResponseProcessCookies processCookies
WARNING: Cookie rejected:  [version: 0][name: JSESSIONID][value: A13ACF598AEEDA1D1533CED60B7E96A2][domain: dev.lutece.paris.fr][path: /nexus][expiry: null] . Illegal path attribute  /nexus . Path of origin:  /snapshot_repository/fr/paris/lutece/plugins/library-indexer/maven-metadata.xml.sha1 

                        
Downloaded: http://dev.lutece.paris.fr/snapshot_repository/fr/paris/lutece/plugins/library-indexer/maven-metadata.xml (532 B at 2.3 KB/sec)
mars 10, 2014 11:02:25 AM org.apache.maven.wagon.providers.http.httpclient.client.protocol.ResponseProcessCookies processCookies
WARNING: Cookie rejected:  [version: 0][name: JSESSIONID][value: D5F7481FB3DDAC29D64C3A70631DCBF7][domain: dev.lutece.paris.fr][path: /nexus][expiry: null] . Illegal path attribute  /nexus . Path of origin:  /maven_repository/fr/paris/lutece/plugins/library-indexer/maven-metadata.xml.sha1 
                        
Downloaded: http://dev.lutece.paris.fr/maven_repository/fr/paris/lutece/plugins/library-indexer/maven-metadata.xml (658 B at 2.0 KB/sec)
Downloading: http://dev.lutece.paris.fr/maven_repository/fr/paris/lutece/plugins/library-indexer/2.0.11-SNAPSHOT/maven-metadata.xml
Downloading: http://dev.lutece.paris.fr/snapshot_repository/fr/paris/lutece/plugins/library-indexer/2.0.11-SNAPSHOT/maven-metadata.xml
                        mars 10, 2014 11:02:25 AM org.apache.maven.wagon.providers.http.httpclient.client.protocol.ResponseProcessCookies processCookies
WARNING: Cookie rejected:  [version: 0][name: JSESSIONID][value: B4CDCF38D656E7AE750081E9768F4FC1][domain: dev.lutece.paris.fr][path: /nexus][expiry: null] . Illegal path attribute  /nexus . Path of origin:  /maven_repository/fr/paris/lutece/plugins/library-indexer/2.0.11-SNAPSHOT/maven-metadata.xml 
mars 10, 2014 11:02:25 AM org.apache.maven.wagon.providers.http.httpclient.client.protocol.ResponseProcessCookies processCookies
WARNING: Cookie rejected:  [version: 0][name: JSESSIONID][value: 2850D5D861CD6AF6EE7B0560E3EBB2DE][domain: dev.lutece.paris.fr][path: /nexus][expiry: null] . Illegal path attribute  /nexus . Path of origin:  /snapshot_repository/fr/paris/lutece/plugins/library-indexer/2.0.11-SNAPSHOT/maven-metadata.xml 

376/376 B               mars 10, 2014 11:02:25 AM org.apache.maven.wagon.providers.http.httpclient.client.protocol.ResponseProcessCookies processCookies
WARNING: Cookie rejected:  [version: 0][name: JSESSIONID][value: 49974894FF4558E1432C8C2FAF673565][domain: dev.lutece.paris.fr][path: /nexus][expiry: null] . Illegal path attribute  /nexus . Path of origin:  /snapshot_repository/fr/paris/lutece/plugins/library-indexer/2.0.11-SNAPSHOT/maven-metadata.xml.sha1 

            
Downloaded: http://dev.lutece.paris.fr/snapshot_repository/fr/paris/lutece/plugins/library-indexer/2.0.11-SNAPSHOT/maven-metadata.xml (376 B at 1.7 KB/sec)
Downloading: http://dev.lutece.paris.fr/snapshot_repository/fr/paris/lutece/plugins/plugin-document/2.1.6-SNAPSHOT/maven-metadata.xml
Downloading: http://dev.lutece.paris.fr/maven_repository/fr/paris/lutece/plugins/plugin-document/2.1.6-SNAPSHOT/maven-metadata.xml
mars 10, 2014 11:02:25 AM org.apache.maven.wagon.providers.http.httpclient.client.protocol.ResponseProcessCookies processCookies
WARNING: Cookie rejected:  [version: 0][name: JSESSIONID][value: 225DF811256FB5341AFBEDB3BD8F44A3][domain: dev.lutece.paris.fr][path: /nexus][expiry: null] . Illegal path attribute  /nexus . Path of origin:  /snapshot_repository/fr/paris/lutece/plugins/plugin-document/2.1.6-SNAPSHOT/maven-metadata.xml 
374/374 B   mars 10, 2014 11:02:25 AM org.apache.maven.wagon.providers.http.httpclient.client.protocol.ResponseProcessCookies processCookies
WARNING: Cookie rejected:  [version: 0][name: JSESSIONID][value: 2C2B627FFAF05123F5414E8098C04A4B][domain: dev.lutece.paris.fr][path: /nexus][expiry: null] . Illegal path attribute  /nexus . Path of origin:  /maven_repository/fr/paris/lutece/plugins/plugin-document/2.1.6-SNAPSHOT/maven-metadata.xml 

            mars 10, 2014 11:02:25 AM org.apache.maven.wagon.providers.http.httpclient.client.protocol.ResponseProcessCookies processCookies
WARNING: Cookie rejected:  [version: 0][name: JSESSIONID][value: 29B9EE49E9E3F8FF264CDA49B21BC78E][domain: dev.lutece.paris.fr][path: /nexus][expiry: null] . Illegal path attribute  /nexus . Path of origin:  /snapshot_repository/fr/paris/lutece/plugins/plugin-document/2.1.6-SNAPSHOT/maven-metadata.xml.sha1 

            
Downloaded: http://dev.lutece.paris.fr/snapshot_repository/fr/paris/lutece/plugins/plugin-document/2.1.6-SNAPSHOT/maven-metadata.xml (374 B at 1.7 KB/sec)
Downloading: http://dev.lutece.paris.fr/snapshot_repository/fr/paris/lutece/plugins/plugin-document/2.2.4-SNAPSHOT/maven-metadata.xml
Downloading: http://dev.lutece.paris.fr/maven_repository/fr/paris/lutece/plugins/plugin-document/2.2.4-SNAPSHOT/maven-metadata.xml
mars 10, 2014 11:02:25 AM org.apache.maven.wagon.providers.http.httpclient.client.protocol.ResponseProcessCookies processCookies
WARNING: Cookie rejected:  [version: 0][name: JSESSIONID][value: 985D54EC2256F08F095D8DA2A9EFB90A][domain: dev.lutece.paris.fr][path: /nexus][expiry: null] . Illegal path attribute  /nexus . Path of origin:  /maven_repository/fr/paris/lutece/plugins/plugin-document/2.2.4-SNAPSHOT/maven-metadata.xml 
            mars 10, 2014 11:02:25 AM org.apache.maven.wagon.providers.http.httpclient.client.protocol.ResponseProcessCookies processCookies
WARNING: Cookie rejected:  [version: 0][name: JSESSIONID][value: 674947B25F2898615562B90211A3DA06][domain: dev.lutece.paris.fr][path: /nexus][expiry: null] . Illegal path attribute  /nexus . Path of origin:  /snapshot_repository/fr/paris/lutece/plugins/plugin-document/2.2.4-SNAPSHOT/maven-metadata.xml 

375/375 B   mars 10, 2014 11:02:25 AM org.apache.maven.wagon.providers.http.httpclient.client.protocol.ResponseProcessCookies processCookies
WARNING: Cookie rejected:  [version: 0][name: JSESSIONID][value: D1265B0CCE1011AB48B21E653706B6F0][domain: dev.lutece.paris.fr][path: /nexus][expiry: null] . Illegal path attribute  /nexus . Path of origin:  /snapshot_repository/fr/paris/lutece/plugins/plugin-document/2.2.4-SNAPSHOT/maven-metadata.xml.sha1 

            
Downloaded: http://dev.lutece.paris.fr/snapshot_repository/fr/paris/lutece/plugins/plugin-document/2.2.4-SNAPSHOT/maven-metadata.xml (375 B at 1.3 KB/sec)
Downloading: http://dev.lutece.paris.fr/maven_repository/fr/paris/lutece/plugins/plugin-document/3.0.1-SNAPSHOT/maven-metadata.xml
Downloading: http://dev.lutece.paris.fr/snapshot_repository/fr/paris/lutece/plugins/plugin-document/3.0.1-SNAPSHOT/maven-metadata.xml
mars 10, 2014 11:02:26 AM org.apache.maven.wagon.providers.http.httpclient.client.protocol.ResponseProcessCookies processCookies
WARNING: Cookie rejected:  [version: 0][name: JSESSIONID][value: 286EC3B4EBCB81984476232A3659BA56][domain: dev.lutece.paris.fr][path: /nexus][expiry: null] . Illegal path attribute  /nexus . Path of origin:  /maven_repository/fr/paris/lutece/plugins/plugin-document/3.0.1-SNAPSHOT/maven-metadata.xml 
            mars 10, 2014 11:02:26 AM org.apache.maven.wagon.providers.http.httpclient.client.protocol.ResponseProcessCookies processCookies
WARNING: Cookie rejected:  [version: 0][name: JSESSIONID][value: A0B442AFA2B0F0053F5222DAA1F57EC5][domain: dev.lutece.paris.fr][path: /nexus][expiry: null] . Illegal path attribute  /nexus . Path of origin:  /snapshot_repository/fr/paris/lutece/plugins/plugin-document/3.0.1-SNAPSHOT/maven-metadata.xml 

375/375 B   mars 10, 2014 11:02:26 AM org.apache.maven.wagon.providers.http.httpclient.client.protocol.ResponseProcessCookies processCookies
WARNING: Cookie rejected:  [version: 0][name: JSESSIONID][value: D7275658D053454B569ECBD83C05E870][domain: dev.lutece.paris.fr][path: /nexus][expiry: null] . Illegal path attribute  /nexus . Path of origin:  /snapshot_repository/fr/paris/lutece/plugins/plugin-document/3.0.1-SNAPSHOT/maven-metadata.xml.sha1 

            
Downloaded: http://dev.lutece.paris.fr/snapshot_repository/fr/paris/lutece/plugins/plugin-document/3.0.1-SNAPSHOT/maven-metadata.xml (375 B at 1.2 KB/sec)
Downloading: http://dev.lutece.paris.fr/maven_repository/fr/paris/lutece/plugins/plugin-document/3.1.2-SNAPSHOT/maven-metadata.xml
Downloading: http://dev.lutece.paris.fr/snapshot_repository/fr/paris/lutece/plugins/plugin-document/3.1.2-SNAPSHOT/maven-metadata.xml
mars 10, 2014 11:02:26 AM org.apache.maven.wagon.providers.http.httpclient.client.protocol.ResponseProcessCookies processCookies
WARNING: Cookie rejected:  [version: 0][name: JSESSIONID][value: F4DF12F29C8B52788A47D9E4580D8996][domain: dev.lutece.paris.fr][path: /nexus][expiry: null] . Illegal path attribute  /nexus . Path of origin:  /snapshot_repository/fr/paris/lutece/plugins/plugin-document/3.1.2-SNAPSHOT/maven-metadata.xml 
374/374 B   mars 10, 2014 11:02:26 AM org.apache.maven.wagon.providers.http.httpclient.client.protocol.ResponseProcessCookies processCookies
WARNING: Cookie rejected:  [version: 0][name: JSESSIONID][value: 54D4440779E5A9C3B7808BE79108F9D2][domain: dev.lutece.paris.fr][path: /nexus][expiry: null] . Illegal path attribute  /nexus . Path of origin:  /maven_repository/fr/paris/lutece/plugins/plugin-document/3.1.2-SNAPSHOT/maven-metadata.xml 

            mars 10, 2014 11:02:26 AM org.apache.maven.wagon.providers.http.httpclient.client.protocol.ResponseProcessCookies processCookies
WARNING: Cookie rejected:  [version: 0][name: JSESSIONID][value: A0F5C78CB8DE69BD9CE261FFE88BF6D9][domain: dev.lutece.paris.fr][path: /nexus][expiry: null] . Illegal path attribute  /nexus . Path of origin:  /snapshot_repository/fr/paris/lutece/plugins/plugin-document/3.1.2-SNAPSHOT/maven-metadata.xml.sha1 

            
Downloaded: http://dev.lutece.paris.fr/snapshot_repository/fr/paris/lutece/plugins/plugin-document/3.1.2-SNAPSHOT/maven-metadata.xml (374 B at 1.8 KB/sec)
Downloading: http://dev.lutece.paris.fr/snapshot_repository/fr/paris/lutece/plugins/plugin-client/0.0.1-SNAPSHOT/maven-metadata.xml
Downloading: http://dev.lutece.paris.fr/maven_repository/fr/paris/lutece/plugins/plugin-client/0.0.1-SNAPSHOT/maven-metadata.xml
mars 10, 2014 11:02:26 AM org.apache.maven.wagon.providers.http.httpclient.client.protocol.ResponseProcessCookies processCookies
WARNING: Cookie rejected:  [version: 0][name: JSESSIONID][value: 55FDE22902FF66CFC80428A1544B43D6][domain: dev.lutece.paris.fr][path: /nexus][expiry: null] . Illegal path attribute  /nexus . Path of origin:  /maven_repository/fr/paris/lutece/plugins/plugin-client/0.0.1-SNAPSHOT/maven-metadata.xml 
            mars 10, 2014 11:02:26 AM org.apache.maven.wagon.providers.http.httpclient.client.protocol.ResponseProcessCookies processCookies
WARNING: Cookie rejected:  [version: 0][name: JSESSIONID][value: 376272DF7FC157339F8A921A94159582][domain: dev.lutece.paris.fr][path: /nexus][expiry: null] . Illegal path attribute  /nexus . Path of origin:  /snapshot_repository/fr/paris/lutece/plugins/plugin-client/0.0.1-SNAPSHOT/maven-metadata.xml 

            
Downloading: http://dev.lutece.paris.fr/maven_repository/fr/paris/lutece/plugins/plugin-client/0.0.1-SNAPSHOT/plugin-client-0.0.1-SNAPSHOT.pom
mars 10, 2014 11:02:26 AM org.apache.maven.wagon.providers.http.httpclient.client.protocol.ResponseProcessCookies processCookies
WARNING: Cookie rejected:  [version: 0][name: JSESSIONID][value: 3BCCFA00B43AF2FE5FE866542038DA97][domain: dev.lutece.paris.fr][path: /nexus][expiry: null] . Illegal path attribute  /nexus . Path of origin:  /maven_repository/fr/paris/lutece/plugins/plugin-client/0.0.1-SNAPSHOT/plugin-client-0.0.1-SNAPSHOT.pom 
            
Downloading: http://dev.lutece.paris.fr/snapshot_repository/fr/paris/lutece/plugins/plugin-client/0.0.1-SNAPSHOT/plugin-client-0.0.1-SNAPSHOT.pom
mars 10, 2014 11:02:27 AM org.apache.maven.wagon.providers.http.httpclient.client.protocol.ResponseProcessCookies processCookies
WARNING: Cookie rejected:  [version: 0][name: JSESSIONID][value: 006F713ECDCB2A17686613BC9DFC61DB][domain: dev.lutece.paris.fr][path: /nexus][expiry: null] . Illegal path attribute  /nexus . Path of origin:  /snapshot_repository/fr/paris/lutece/plugins/plugin-client/0.0.1-SNAPSHOT/plugin-client-0.0.1-SNAPSHOT.pom 
            
[WARNING] The POM for fr.paris.lutece.plugins:plugin-client:jar:0.0.1-SNAPSHOT is missing, no dependency information available
Downloading: http://dev.lutece.paris.fr/snapshot_repository/fr/paris/lutece/plugins/plugin-upload/1.0.2-SNAPSHOT/maven-metadata.xml
Downloading: http://dev.lutece.paris.fr/maven_repository/fr/paris/lutece/plugins/plugin-upload/1.0.2-SNAPSHOT/maven-metadata.xml
mars 10, 2014 11:02:27 AM org.apache.maven.wagon.providers.http.httpclient.client.protocol.ResponseProcessCookies processCookies
WARNING: Cookie rejected:  [version: 0][name: JSESSIONID][value: B6B56DAD69E1E0C3FEB0AA3C42762B21][domain: dev.lutece.paris.fr][path: /nexus][expiry: null] . Illegal path attribute  /nexus . Path of origin:  /maven_repository/fr/paris/lutece/plugins/plugin-upload/1.0.2-SNAPSHOT/maven-metadata.xml 
mars 10, 2014 11:02:27 AM org.apache.maven.wagon.providers.http.httpclient.client.protocol.ResponseProcessCookies processCookies
WARNING: Cookie rejected:  [version: 0][name: JSESSIONID][value: A69312449729B84E4EEC5A9E39DA49CB][domain: dev.lutece.paris.fr][path: /nexus][expiry: null] . Illegal path attribute  /nexus . Path of origin:  /snapshot_repository/fr/paris/lutece/plugins/plugin-upload/1.0.2-SNAPSHOT/maven-metadata.xml 
            
            
Downloading: http://dev.lutece.paris.fr/maven_repository/fr/paris/lutece/plugins/plugin-upload/1.0.2-SNAPSHOT/plugin-upload-1.0.2-SNAPSHOT.pom
mars 10, 2014 11:02:27 AM org.apache.maven.wagon.providers.http.httpclient.client.protocol.ResponseProcessCookies processCookies
WARNING: Cookie rejected:  [version: 0][name: JSESSIONID][value: B4E09C995BE3B55819C413CFAED9ADB4][domain: dev.lutece.paris.fr][path: /nexus][expiry: null] . Illegal path attribute  /nexus . Path of origin:  /maven_repository/fr/paris/lutece/plugins/plugin-upload/1.0.2-SNAPSHOT/plugin-upload-1.0.2-SNAPSHOT.pom 
            
Downloading: http://dev.lutece.paris.fr/snapshot_repository/fr/paris/lutece/plugins/plugin-upload/1.0.2-SNAPSHOT/plugin-upload-1.0.2-SNAPSHOT.pom
mars 10, 2014 11:02:27 AM org.apache.maven.wagon.providers.http.httpclient.client.protocol.ResponseProcessCookies processCookies
WARNING: Cookie rejected:  [version: 0][name: JSESSIONID][value: B0C0F7A22129B89B623F0F5D753A1BA3][domain: dev.lutece.paris.fr][path: /nexus][expiry: null] . Illegal path attribute  /nexus . Path of origin:  /snapshot_repository/fr/paris/lutece/plugins/plugin-upload/1.0.2-SNAPSHOT/plugin-upload-1.0.2-SNAPSHOT.pom 
            
[WARNING] The POM for fr.paris.lutece.plugins:plugin-upload:jar:1.0.2-SNAPSHOT is missing, no dependency information available
Downloading: http://dev.lutece.paris.fr/maven_repository/fr/paris/lutece/plugins/plugin-livreblanc/1.0.0-SNAPSHOT/maven-metadata.xml
Downloading: http://dev.lutece.paris.fr/snapshot_repository/fr/paris/lutece/plugins/plugin-livreblanc/1.0.0-SNAPSHOT/maven-metadata.xml
mars 10, 2014 11:02:28 AM org.apache.maven.wagon.providers.http.httpclient.client.protocol.ResponseProcessCookies processCookies
WARNING: Cookie rejected:  [version: 0][name: JSESSIONID][value: 8B554B3415913F5DD2E86DFBC1A3B4B7][domain: dev.lutece.paris.fr][path: /nexus][expiry: null] . Illegal path attribute  /nexus . Path of origin:  /snapshot_repository/fr/paris/lutece/plugins/plugin-livreblanc/1.0.0-SNAPSHOT/maven-metadata.xml 
mars 10, 2014 11:02:28 AM org.apache.maven.wagon.providers.http.httpclient.client.protocol.ResponseProcessCookies processCookies
WARNING: Cookie rejected:  [version: 0][name: JSESSIONID][value: 358F0AABB4E94DAF57A3CA171AB654AD][domain: dev.lutece.paris.fr][path: /nexus][expiry: null] . Illegal path attribute  /nexus . Path of origin:  /maven_repository/fr/paris/lutece/plugins/plugin-livreblanc/1.0.0-SNAPSHOT/maven-metadata.xml 
            
            
Downloading: http://dev.lutece.paris.fr/maven_repository/fr/paris/lutece/plugins/plugin-livreblanc/1.0.0-SNAPSHOT/plugin-livreblanc-1.0.0-SNAPSHOT.pom
mars 10, 2014 11:02:28 AM org.apache.maven.wagon.providers.http.httpclient.client.protocol.ResponseProcessCookies processCookies
WARNING: Cookie rejected:  [version: 0][name: JSESSIONID][value: BE6F1092A06DE4166766B11172D04F6C][domain: dev.lutece.paris.fr][path: /nexus][expiry: null] . Illegal path attribute  /nexus . Path of origin:  /maven_repository/fr/paris/lutece/plugins/plugin-livreblanc/1.0.0-SNAPSHOT/plugin-livreblanc-1.0.0-SNAPSHOT.pom 
            
Downloading: http://dev.lutece.paris.fr/snapshot_repository/fr/paris/lutece/plugins/plugin-livreblanc/1.0.0-SNAPSHOT/plugin-livreblanc-1.0.0-SNAPSHOT.pom
mars 10, 2014 11:02:28 AM org.apache.maven.wagon.providers.http.httpclient.client.protocol.ResponseProcessCookies processCookies
WARNING: Cookie rejected:  [version: 0][name: JSESSIONID][value: 3A0FF69CC7E01656D2C0C0850E1F502A][domain: dev.lutece.paris.fr][path: /nexus][expiry: null] . Illegal path attribute  /nexus . Path of origin:  /snapshot_repository/fr/paris/lutece/plugins/plugin-livreblanc/1.0.0-SNAPSHOT/plugin-livreblanc-1.0.0-SNAPSHOT.pom 
            
[WARNING] The POM for fr.paris.lutece.plugins:plugin-livreblanc:jar:1.0.0-SNAPSHOT is missing, no dependency information available
Downloading: http://dev.lutece.paris.fr/maven_repository/fr/paris/lutece/plugins/plugin-article/1.0.0-SNAPSHOT/maven-metadata.xml
Downloading: http://dev.lutece.paris.fr/snapshot_repository/fr/paris/lutece/plugins/plugin-article/1.0.0-SNAPSHOT/maven-metadata.xml
mars 10, 2014 11:02:28 AM org.apache.maven.wagon.providers.http.httpclient.client.protocol.ResponseProcessCookies processCookies
WARNING: Cookie rejected:  [version: 0][name: JSESSIONID][value: F2174C415C11AA5DEC105426E5791197][domain: dev.lutece.paris.fr][path: /nexus][expiry: null] . Illegal path attribute  /nexus . Path of origin:  /snapshot_repository/fr/paris/lutece/plugins/plugin-article/1.0.0-SNAPSHOT/maven-metadata.xml 
            mars 10, 2014 11:02:28 AM org.apache.maven.wagon.providers.http.httpclient.client.protocol.ResponseProcessCookies processCookies
WARNING: Cookie rejected:  [version: 0][name: JSESSIONID][value: 65CF4A1B293B0ECCE1845276641DB1EE][domain: dev.lutece.paris.fr][path: /nexus][expiry: null] . Illegal path attribute  /nexus . Path of origin:  /maven_repository/fr/paris/lutece/plugins/plugin-article/1.0.0-SNAPSHOT/maven-metadata.xml 

            
Downloading: http://dev.lutece.paris.fr/maven_repository/fr/paris/lutece/plugins/plugin-article/1.0.0-SNAPSHOT/plugin-article-1.0.0-SNAPSHOT.pom
mars 10, 2014 11:02:28 AM org.apache.maven.wagon.providers.http.httpclient.client.protocol.ResponseProcessCookies processCookies
WARNING: Cookie rejected:  [version: 0][name: JSESSIONID][value: 486D8CE782D5507296497AD3A672CCDA][domain: dev.lutece.paris.fr][path: /nexus][expiry: null] . Illegal path attribute  /nexus . Path of origin:  /maven_repository/fr/paris/lutece/plugins/plugin-article/1.0.0-SNAPSHOT/plugin-article-1.0.0-SNAPSHOT.pom 
            
Downloading: http://dev.lutece.paris.fr/snapshot_repository/fr/paris/lutece/plugins/plugin-article/1.0.0-SNAPSHOT/plugin-article-1.0.0-SNAPSHOT.pom
mars 10, 2014 11:02:28 AM org.apache.maven.wagon.providers.http.httpclient.client.protocol.ResponseProcessCookies processCookies
WARNING: Cookie rejected:  [version: 0][name: JSESSIONID][value: 507B3F1C28EB85F232E348A3DB24DA87][domain: dev.lutece.paris.fr][path: /nexus][expiry: null] . Illegal path attribute  /nexus . Path of origin:  /snapshot_repository/fr/paris/lutece/plugins/plugin-article/1.0.0-SNAPSHOT/plugin-article-1.0.0-SNAPSHOT.pom 
            
[WARNING] The POM for fr.paris.lutece.plugins:plugin-article:jar:1.0.0-SNAPSHOT is missing, no dependency information available
Downloading: http://dev.lutece.paris.fr/snapshot_repository/fr/paris/lutece/plugins/plugin-home/1.0.0-SNAPSHOT/maven-metadata.xml
Downloading: http://dev.lutece.paris.fr/maven_repository/fr/paris/lutece/plugins/plugin-home/1.0.0-SNAPSHOT/maven-metadata.xml
mars 10, 2014 11:02:29 AM org.apache.maven.wagon.providers.http.httpclient.client.protocol.ResponseProcessCookies processCookies
WARNING: Cookie rejected:  [version: 0][name: JSESSIONID][value: 891B4DFE73AC861199422D3F3E832B3F][domain: dev.lutece.paris.fr][path: /nexus][expiry: null] . Illegal path attribute  /nexus . Path of origin:  /snapshot_repository/fr/paris/lutece/plugins/plugin-home/1.0.0-SNAPSHOT/maven-metadata.xml 
mars 10, 2014 11:02:29 AM org.apache.maven.wagon.providers.http.httpclient.client.protocol.ResponseProcessCookies processCookies
WARNING: Cookie rejected:  [version: 0][name: JSESSIONID][value: 66794D7EF3CB8613131D0C170C329175][domain: dev.lutece.paris.fr][path: /nexus][expiry: null] . Illegal path attribute  /nexus . Path of origin:  /maven_repository/fr/paris/lutece/plugins/plugin-home/1.0.0-SNAPSHOT/maven-metadata.xml 
            
            
Downloading: http://dev.lutece.paris.fr/maven_repository/fr/paris/lutece/plugins/plugin-home/1.0.0-SNAPSHOT/plugin-home-1.0.0-SNAPSHOT.pom
mars 10, 2014 11:02:29 AM org.apache.maven.wagon.providers.http.httpclient.client.protocol.ResponseProcessCookies processCookies
WARNING: Cookie rejected:  [version: 0][name: JSESSIONID][value: 86D9ECBEC1765AED695ED8A0E71ED847][domain: dev.lutece.paris.fr][path: /nexus][expiry: null] . Illegal path attribute  /nexus . Path of origin:  /maven_repository/fr/paris/lutece/plugins/plugin-home/1.0.0-SNAPSHOT/plugin-home-1.0.0-SNAPSHOT.pom 
            
Downloading: http://dev.lutece.paris.fr/snapshot_repository/fr/paris/lutece/plugins/plugin-home/1.0.0-SNAPSHOT/plugin-home-1.0.0-SNAPSHOT.pom
mars 10, 2014 11:02:29 AM org.apache.maven.wagon.providers.http.httpclient.client.protocol.ResponseProcessCookies processCookies
WARNING: Cookie rejected:  [version: 0][name: JSESSIONID][value: 981757CEF155D08DB59A6A94C898A216][domain: dev.lutece.paris.fr][path: /nexus][expiry: null] . Illegal path attribute  /nexus . Path of origin:  /snapshot_repository/fr/paris/lutece/plugins/plugin-home/1.0.0-SNAPSHOT/plugin-home-1.0.0-SNAPSHOT.pom 
            
[WARNING] The POM for fr.paris.lutece.plugins:plugin-home:jar:1.0.0-SNAPSHOT is missing, no dependency information available
Downloading: http://dev.lutece.paris.fr/snapshot_repository/fr/paris/lutece/plugins/plugin-search/1.0.0-SNAPSHOT/maven-metadata.xml
Downloading: http://dev.lutece.paris.fr/maven_repository/fr/paris/lutece/plugins/plugin-search/1.0.0-SNAPSHOT/maven-metadata.xml
            mars 10, 2014 11:02:29 AM org.apache.maven.wagon.providers.http.httpclient.client.protocol.ResponseProcessCookies processCookies
WARNING: Cookie rejected:  [version: 0][name: JSESSIONID][value: F5AAEA981810AB201C5953835E19A51C][domain: dev.lutece.paris.fr][path: /nexus][expiry: null] . Illegal path attribute  /nexus . Path of origin:  /snapshot_repository/fr/paris/lutece/plugins/plugin-search/1.0.0-SNAPSHOT/maven-metadata.xml 
mars 10, 2014 11:02:29 AM org.apache.maven.wagon.providers.http.httpclient.client.protocol.ResponseProcessCookies processCookies
WARNING: Cookie rejected:  [version: 0][name: JSESSIONID][value: 84B76474C3F700F9AFAC6E6F5EBA40A4][domain: dev.lutece.paris.fr][path: /nexus][expiry: null] . Illegal path attribute  /nexus . Path of origin:  /maven_repository/fr/paris/lutece/plugins/plugin-search/1.0.0-SNAPSHOT/maven-metadata.xml 

            
Downloading: http://dev.lutece.paris.fr/maven_repository/fr/paris/lutece/plugins/plugin-search/1.0.0-SNAPSHOT/plugin-search-1.0.0-SNAPSHOT.pom
mars 10, 2014 11:02:29 AM org.apache.maven.wagon.providers.http.httpclient.client.protocol.ResponseProcessCookies processCookies
WARNING: Cookie rejected:  [version: 0][name: JSESSIONID][value: 43BE91101C83877BDE2A2B8BCD60F18E][domain: dev.lutece.paris.fr][path: /nexus][expiry: null] . Illegal path attribute  /nexus . Path of origin:  /maven_repository/fr/paris/lutece/plugins/plugin-search/1.0.0-SNAPSHOT/plugin-search-1.0.0-SNAPSHOT.pom 
            
Downloading: http://dev.lutece.paris.fr/snapshot_repository/fr/paris/lutece/plugins/plugin-search/1.0.0-SNAPSHOT/plugin-search-1.0.0-SNAPSHOT.pom
mars 10, 2014 11:02:30 AM org.apache.maven.wagon.providers.http.httpclient.client.protocol.ResponseProcessCookies processCookies
WARNING: Cookie rejected:  [version: 0][name: JSESSIONID][value: 20DD9A76B13CB0A11F639B1120728DCA][domain: dev.lutece.paris.fr][path: /nexus][expiry: null] . Illegal path attribute  /nexus . Path of origin:  /snapshot_repository/fr/paris/lutece/plugins/plugin-search/1.0.0-SNAPSHOT/plugin-search-1.0.0-SNAPSHOT.pom 
            
[WARNING] The POM for fr.paris.lutece.plugins:plugin-search:jar:1.0.0-SNAPSHOT is missing, no dependency information available
Downloading: http://dev.lutece.paris.fr/maven_repository/fr/paris/lutece/plugins/plugin-jcaptcha/2.1.5-SNAPSHOT/maven-metadata.xml
Downloading: http://dev.lutece.paris.fr/snapshot_repository/fr/paris/lutece/plugins/plugin-jcaptcha/2.1.5-SNAPSHOT/maven-metadata.xml
mars 10, 2014 11:02:30 AM org.apache.maven.wagon.providers.http.httpclient.client.protocol.ResponseProcessCookies processCookies
WARNING: Cookie rejected:  [version: 0][name: JSESSIONID][value: 9355D5425F40DE6D7AC853A8BA624FBB][domain: dev.lutece.paris.fr][path: /nexus][expiry: null] . Illegal path attribute  /nexus . Path of origin:  /maven_repository/fr/paris/lutece/plugins/plugin-jcaptcha/2.1.5-SNAPSHOT/maven-metadata.xml 
mars 10, 2014 11:02:30 AM org.apache.maven.wagon.providers.http.httpclient.client.protocol.ResponseProcessCookies processCookies
WARNING: Cookie rejected:  [version: 0][name: JSESSIONID][value: 35FEC74457A5681029A14879591A9AF9][domain: dev.lutece.paris.fr][path: /nexus][expiry: null] . Illegal path attribute  /nexus . Path of origin:  /snapshot_repository/fr/paris/lutece/plugins/plugin-jcaptcha/2.1.5-SNAPSHOT/maven-metadata.xml 
            
374/374 B   mars 10, 2014 11:02:30 AM org.apache.maven.wagon.providers.http.httpclient.client.protocol.ResponseProcessCookies processCookies
WARNING: Cookie rejected:  [version: 0][name: JSESSIONID][value: F4986105032E452FE4C275554EB4DFA1][domain: dev.lutece.paris.fr][path: /nexus][expiry: null] . Illegal path attribute  /nexus . Path of origin:  /snapshot_repository/fr/paris/lutece/plugins/plugin-jcaptcha/2.1.5-SNAPSHOT/maven-metadata.xml.sha1 

            
Downloaded: http://dev.lutece.paris.fr/snapshot_repository/fr/paris/lutece/plugins/plugin-jcaptcha/2.1.5-SNAPSHOT/maven-metadata.xml (374 B at 1.2 KB/sec)
Downloading: http://dev.lutece.paris.fr/maven_repository/fr/paris/lutece/plugins/plugin-uploadimage/1.0.2-SNAPSHOT/maven-metadata.xml
Downloading: http://dev.lutece.paris.fr/snapshot_repository/fr/paris/lutece/plugins/plugin-uploadimage/1.0.2-SNAPSHOT/maven-metadata.xml
mars 10, 2014 11:02:30 AM org.apache.maven.wagon.providers.http.httpclient.client.protocol.ResponseProcessCookies processCookies
WARNING: Cookie rejected:  [version: 0][name: JSESSIONID][value: 8DBB9BC19FC28D7692A6E65B9EA3083D][domain: dev.lutece.paris.fr][path: /nexus][expiry: null] . Illegal path attribute  /nexus . Path of origin:  /snapshot_repository/fr/paris/lutece/plugins/plugin-uploadimage/1.0.2-SNAPSHOT/maven-metadata.xml 
            mars 10, 2014 11:02:30 AM org.apache.maven.wagon.providers.http.httpclient.client.protocol.ResponseProcessCookies processCookies
WARNING: Cookie rejected:  [version: 0][name: JSESSIONID][value: CCFE854053C555C99F9F56DBA48A07D0][domain: dev.lutece.paris.fr][path: /nexus][expiry: null] . Illegal path attribute  /nexus . Path of origin:  /maven_repository/fr/paris/lutece/plugins/plugin-uploadimage/1.0.2-SNAPSHOT/maven-metadata.xml 

            
Downloading: http://dev.lutece.paris.fr/maven_repository/fr/paris/lutece/plugins/plugin-uploadimage/1.0.2-SNAPSHOT/plugin-uploadimage-1.0.2-SNAPSHOT.pom
mars 10, 2014 11:02:30 AM org.apache.maven.wagon.providers.http.httpclient.client.protocol.ResponseProcessCookies processCookies
WARNING: Cookie rejected:  [version: 0][name: JSESSIONID][value: C81FE139A76D7C1B07D5D34E94869877][domain: dev.lutece.paris.fr][path: /nexus][expiry: null] . Illegal path attribute  /nexus . Path of origin:  /maven_repository/fr/paris/lutece/plugins/plugin-uploadimage/1.0.2-SNAPSHOT/plugin-uploadimage-1.0.2-SNAPSHOT.pom 
            
Downloading: http://dev.lutece.paris.fr/snapshot_repository/fr/paris/lutece/plugins/plugin-uploadimage/1.0.2-SNAPSHOT/plugin-uploadimage-1.0.2-SNAPSHOT.pom
            mars 10, 2014 11:02:31 AM org.apache.maven.wagon.providers.http.httpclient.client.protocol.ResponseProcessCookies processCookies
WARNING: Cookie rejected:  [version: 0][name: JSESSIONID][value: F11C2033BE7891F7FBAD5E0854184048][domain: dev.lutece.paris.fr][path: /nexus][expiry: null] . Illegal path attribute  /nexus . Path of origin:  /snapshot_repository/fr/paris/lutece/plugins/plugin-uploadimage/1.0.2-SNAPSHOT/plugin-uploadimage-1.0.2-SNAPSHOT.pom 

[WARNING] The POM for fr.paris.lutece.plugins:plugin-uploadimage:jar:1.0.2-SNAPSHOT is missing, no dependency information available
Downloading: http://dev.lutece.paris.fr/snapshot_repository/fr/paris/lutece/plugins/plugin-etat/1.0.0-SNAPSHOT/maven-metadata.xml
Downloading: http://dev.lutece.paris.fr/maven_repository/fr/paris/lutece/plugins/plugin-etat/1.0.0-SNAPSHOT/maven-metadata.xml
mars 10, 2014 11:02:31 AM org.apache.maven.wagon.providers.http.httpclient.client.protocol.ResponseProcessCookies processCookies
WARNING: Cookie rejected:  [version: 0][name: JSESSIONID][value: D5398ACB87FE3A92F266CC1C2C83D9D3][domain: dev.lutece.paris.fr][path: /nexus][expiry: null] . Illegal path attribute  /nexus . Path of origin:  /maven_repository/fr/paris/lutece/plugins/plugin-etat/1.0.0-SNAPSHOT/maven-metadata.xml 
            mars 10, 2014 11:02:31 AM org.apache.maven.wagon.providers.http.httpclient.client.protocol.ResponseProcessCookies processCookies
WARNING: Cookie rejected:  [version: 0][name: JSESSIONID][value: 7D9BEC35FB58D1D4CDD7CD4A5AC340F5][domain: dev.lutece.paris.fr][path: /nexus][expiry: null] . Illegal path attribute  /nexus . Path of origin:  /snapshot_repository/fr/paris/lutece/plugins/plugin-etat/1.0.0-SNAPSHOT/maven-metadata.xml 

            
Downloading: http://dev.lutece.paris.fr/maven_repository/fr/paris/lutece/plugins/plugin-etat/1.0.0-SNAPSHOT/plugin-etat-1.0.0-SNAPSHOT.pom
mars 10, 2014 11:02:31 AM org.apache.maven.wagon.providers.http.httpclient.client.protocol.ResponseProcessCookies processCookies
WARNING: Cookie rejected:  [version: 0][name: JSESSIONID][value: CDC6172A18E020E4A8A3AFB141F353D6][domain: dev.lutece.paris.fr][path: /nexus][expiry: null] . Illegal path attribute  /nexus . Path of origin:  /maven_repository/fr/paris/lutece/plugins/plugin-etat/1.0.0-SNAPSHOT/plugin-etat-1.0.0-SNAPSHOT.pom 
            
Downloading: http://dev.lutece.paris.fr/snapshot_repository/fr/paris/lutece/plugins/plugin-etat/1.0.0-SNAPSHOT/plugin-etat-1.0.0-SNAPSHOT.pom
mars 10, 2014 11:02:31 AM org.apache.maven.wagon.providers.http.httpclient.client.protocol.ResponseProcessCookies processCookies
WARNING: Cookie rejected:  [version: 0][name: JSESSIONID][value: 54CB0CE0CD8CA2B343E42A5BDF3BD10C][domain: dev.lutece.paris.fr][path: /nexus][expiry: null] . Illegal path attribute  /nexus . Path of origin:  /snapshot_repository/fr/paris/lutece/plugins/plugin-etat/1.0.0-SNAPSHOT/plugin-etat-1.0.0-SNAPSHOT.pom 
            
[WARNING] The POM for fr.paris.lutece.plugins:plugin-etat:jar:1.0.0-SNAPSHOT is missing, no dependency information available
Downloading: http://dev.lutece.paris.fr/maven_repository/fr/paris/lutece/plugins/plugin-plansite/1.0.1-SNAPSHOT/maven-metadata.xml
Downloading: http://dev.lutece.paris.fr/snapshot_repository/fr/paris/lutece/plugins/plugin-plansite/1.0.1-SNAPSHOT/maven-metadata.xml
mars 10, 2014 11:02:31 AM org.apache.maven.wagon.providers.http.httpclient.client.protocol.ResponseProcessCookies processCookies
WARNING: Cookie rejected:  [version: 0][name: JSESSIONID][value: FECA1009503687E77B41C08B9420872E][domain: dev.lutece.paris.fr][path: /nexus][expiry: null] . Illegal path attribute  /nexus . Path of origin:  /snapshot_repository/fr/paris/lutece/plugins/plugin-plansite/1.0.1-SNAPSHOT/maven-metadata.xml 
mars 10, 2014 11:02:31 AM org.apache.maven.wagon.providers.http.httpclient.client.protocol.ResponseProcessCookies processCookies
WARNING: Cookie rejected:  [version: 0][name: JSESSIONID][value: C18D9001CB01DF6B261C09488394C8F4][domain: dev.lutece.paris.fr][path: /nexus][expiry: null] . Illegal path attribute  /nexus . Path of origin:  /maven_repository/fr/paris/lutece/plugins/plugin-plansite/1.0.1-SNAPSHOT/maven-metadata.xml 
            
            
Downloading: http://dev.lutece.paris.fr/maven_repository/fr/paris/lutece/plugins/plugin-plansite/1.0.1-SNAPSHOT/plugin-plansite-1.0.1-SNAPSHOT.pom
mars 10, 2014 11:02:32 AM org.apache.maven.wagon.providers.http.httpclient.client.protocol.ResponseProcessCookies processCookies
WARNING: Cookie rejected:  [version: 0][name: JSESSIONID][value: A52CD3F3891DDB763669F5262E18A4B0][domain: dev.lutece.paris.fr][path: /nexus][expiry: null] . Illegal path attribute  /nexus . Path of origin:  /maven_repository/fr/paris/lutece/plugins/plugin-plansite/1.0.1-SNAPSHOT/plugin-plansite-1.0.1-SNAPSHOT.pom 
            
Downloading: http://dev.lutece.paris.fr/snapshot_repository/fr/paris/lutece/plugins/plugin-plansite/1.0.1-SNAPSHOT/plugin-plansite-1.0.1-SNAPSHOT.pom
mars 10, 2014 11:02:32 AM org.apache.maven.wagon.providers.http.httpclient.client.protocol.ResponseProcessCookies processCookies
WARNING: Cookie rejected:  [version: 0][name: JSESSIONID][value: 68FF49F1E8E96DF9A108D0A63C496269][domain: dev.lutece.paris.fr][path: /nexus][expiry: null] . Illegal path attribute  /nexus . Path of origin:  /snapshot_repository/fr/paris/lutece/plugins/plugin-plansite/1.0.1-SNAPSHOT/plugin-plansite-1.0.1-SNAPSHOT.pom 
            
[WARNING] The POM for fr.paris.lutece.plugins:plugin-plansite:jar:1.0.1-SNAPSHOT is missing, no dependency information available
Downloading: http://dev.lutece.paris.fr/maven_repository/fr/paris/lutece/plugins/plugin-carte/1.0.0-SNAPSHOT/maven-metadata.xml
Downloading: http://dev.lutece.paris.fr/snapshot_repository/fr/paris/lutece/plugins/plugin-carte/1.0.0-SNAPSHOT/maven-metadata.xml
mars 10, 2014 11:02:32 AM org.apache.maven.wagon.providers.http.httpclient.client.protocol.ResponseProcessCookies processCookies
WARNING: Cookie rejected:  [version: 0][name: JSESSIONID][value: 70D878FC5F83D5B3D0DDA8907CFB2CEB][domain: dev.lutece.paris.fr][path: /nexus][expiry: null] . Illegal path attribute  /nexus . Path of origin:  /maven_repository/fr/paris/lutece/plugins/plugin-carte/1.0.0-SNAPSHOT/maven-metadata.xml 
            mars 10, 2014 11:02:32 AM org.apache.maven.wagon.providers.http.httpclient.client.protocol.ResponseProcessCookies processCookies
WARNING: Cookie rejected:  [version: 0][name: JSESSIONID][value: 55234A1212C386EBFC62538FE544558E][domain: dev.lutece.paris.fr][path: /nexus][expiry: null] . Illegal path attribute  /nexus . Path of origin:  /snapshot_repository/fr/paris/lutece/plugins/plugin-carte/1.0.0-SNAPSHOT/maven-metadata.xml 

            
Downloading: http://dev.lutece.paris.fr/maven_repository/fr/paris/lutece/plugins/plugin-carte/1.0.0-SNAPSHOT/plugin-carte-1.0.0-SNAPSHOT.pom
mars 10, 2014 11:02:32 AM org.apache.maven.wagon.providers.http.httpclient.client.protocol.ResponseProcessCookies processCookies
WARNING: Cookie rejected:  [version: 0][name: JSESSIONID][value: 470F0AAA5CEA0164862555D41410952A][domain: dev.lutece.paris.fr][path: /nexus][expiry: null] . Illegal path attribute  /nexus . Path of origin:  /maven_repository/fr/paris/lutece/plugins/plugin-carte/1.0.0-SNAPSHOT/plugin-carte-1.0.0-SNAPSHOT.pom 
            
Downloading: http://dev.lutece.paris.fr/snapshot_repository/fr/paris/lutece/plugins/plugin-carte/1.0.0-SNAPSHOT/plugin-carte-1.0.0-SNAPSHOT.pom
mars 10, 2014 11:02:33 AM org.apache.maven.wagon.providers.http.httpclient.client.protocol.ResponseProcessCookies processCookies
WARNING: Cookie rejected:  [version: 0][name: JSESSIONID][value: 4DBE9295CF8D5824866894AFA3F84453][domain: dev.lutece.paris.fr][path: /nexus][expiry: null] . Illegal path attribute  /nexus . Path of origin:  /snapshot_repository/fr/paris/lutece/plugins/plugin-carte/1.0.0-SNAPSHOT/plugin-carte-1.0.0-SNAPSHOT.pom 
            
[WARNING] The POM for fr.paris.lutece.plugins:plugin-carte:jar:1.0.0-SNAPSHOT is missing, no dependency information available
Downloading: http://dev.lutece.paris.fr/maven_repository/fr/paris/lutece/plugins/plugin-evenement/1.0.0-SNAPSHOT/maven-metadata.xml
Downloading: http://dev.lutece.paris.fr/snapshot_repository/fr/paris/lutece/plugins/plugin-evenement/1.0.0-SNAPSHOT/maven-metadata.xml
mars 10, 2014 11:02:33 AM org.apache.maven.wagon.providers.http.httpclient.client.protocol.ResponseProcessCookies processCookies
WARNING: Cookie rejected:  [version: 0][name: JSESSIONID][value: 7C3D73161B21C1285E4AAE30DDDC6811][domain: dev.lutece.paris.fr][path: /nexus][expiry: null] . Illegal path attribute  /nexus . Path of origin:  /snapshot_repository/fr/paris/lutece/plugins/plugin-evenement/1.0.0-SNAPSHOT/maven-metadata.xml 
mars 10, 2014 11:02:33 AM org.apache.maven.wagon.providers.http.httpclient.client.protocol.ResponseProcessCookies processCookies
WARNING: Cookie rejected:  [version: 0][name: JSESSIONID][value: 7EDA6A89285EA81ED9067E28F006DE89][domain: dev.lutece.paris.fr][path: /nexus][expiry: null] . Illegal path attribute  /nexus . Path of origin:  /maven_repository/fr/paris/lutece/plugins/plugin-evenement/1.0.0-SNAPSHOT/maven-metadata.xml 
            
            
Downloading: http://dev.lutece.paris.fr/maven_repository/fr/paris/lutece/plugins/plugin-evenement/1.0.0-SNAPSHOT/plugin-evenement-1.0.0-SNAPSHOT.pom
mars 10, 2014 11:02:33 AM org.apache.maven.wagon.providers.http.httpclient.client.protocol.ResponseProcessCookies processCookies
WARNING: Cookie rejected:  [version: 0][name: JSESSIONID][value: D034EEAF57682C2940DADA6BFE093493][domain: dev.lutece.paris.fr][path: /nexus][expiry: null] . Illegal path attribute  /nexus . Path of origin:  /maven_repository/fr/paris/lutece/plugins/plugin-evenement/1.0.0-SNAPSHOT/plugin-evenement-1.0.0-SNAPSHOT.pom 
            
Downloading: http://dev.lutece.paris.fr/snapshot_repository/fr/paris/lutece/plugins/plugin-evenement/1.0.0-SNAPSHOT/plugin-evenement-1.0.0-SNAPSHOT.pom
mars 10, 2014 11:02:34 AM org.apache.maven.wagon.providers.http.httpclient.client.protocol.ResponseProcessCookies processCookies
WARNING: Cookie rejected:  [version: 0][name: JSESSIONID][value: B86867C35C161FF20E9F29B620003B67][domain: dev.lutece.paris.fr][path: /nexus][expiry: null] . Illegal path attribute  /nexus . Path of origin:  /snapshot_repository/fr/paris/lutece/plugins/plugin-evenement/1.0.0-SNAPSHOT/plugin-evenement-1.0.0-SNAPSHOT.pom 
            
[WARNING] The POM for fr.paris.lutece.plugins:plugin-evenement:jar:1.0.0-SNAPSHOT is missing, no dependency information available
[INFO] ------------------------------------------------------------------------
[INFO] BUILD FAILURE
[INFO] ------------------------------------------------------------------------
[INFO] Total time: 25.699s
[INFO] Finished at: Mon Mar 10 11:02:34 GMT 2014
[INFO] Final Memory: 16M/99M
[INFO] ------------------------------------------------------------------------
[ERROR] Failed to execute goal on project Transfusion: Could not resolve dependencies for project fr.paris.lutece:Transfusion:lutece-site:2.0: Failed to collect dependencies for fr.paris.lutece:Transfusion:lutece-site:2.0: Could not resolve version conflict among [fr.paris.lutece:lutece-core:jar:3.1.6, fr.paris.lutece.plugins:plugin-html:jar:2.1.3 - fr.paris.lutece:lutece-core:jar:[2.3.0,4.0.0-SNAPSHOT), fr.paris.lutece.plugins:plugin-newsletter:jar:2.2.10-SNAPSHOT - fr.paris.lutece:lutece-core:jar:[2.3.0,5.0.0-SNAPSHOT), fr.paris.lutece.plugins:plugin-newsletter:jar:2.2.10-SNAPSHOT - fr.paris.lutece.plugins:plugin-document:jar:[2.0.14,5.0.0-SNAPSHOT) - fr.paris.lutece:lutece-core:jar:[4.1.0-SNAPSHOT,5.0.0-SNAPSHOT), fr.paris.lutece.plugins:plugin-jcaptcha:jar:2.1.5-SNAPSHOT - fr.paris.lutece:lutece-core:jar:[2.4.0,5.0.0-SNAPSHOT), fr.paris.lutece.plugins:plugin-contact:jar:2.1.4 - fr.paris.lutece:lutece-core:jar:[2.3.1,4.0.0-SNAPSHOT), fr.paris.lutece.plugins:library-lutece-unit-testing:jar:2.0.6 - fr.paris.lutece:lutece-core:jar:RELEASE] - [Help 1]
[ERROR] 
[ERROR] To see the full stack trace of the errors, re-run Maven with the -e switch.
[ERROR] Re-run Maven using the -X switch to enable full debug logging.
[ERROR] 
[ERROR] For more information about the errors and possible solutions, please read the following articles:
[ERROR] [Help 1] http://cwiki.apache.org/confluence/display/MAVEN/DependencyResolutionException

JGO
Bonjour, Il s'agit d'un problème de compatibilité de dépendances du core. Le problème est décrit dans l'avant-dernier message du forum : Problème lors de l'execution du goal lutece:exploded JGO

 

annamir
Merci pour la reponse. J'ai réussit l'assemblage du site, lors de la consultation du site j'ai l'erreur suivant: mars 11, 2014 4:16:11 PM org.apache.catalina.core.AprLifecycleListener init INFO: The APR based Apache Tomcat Native library which allows optimal performance in production environments was not found on the java.library.path: C:\Program Files\Java\jre7\bin;C:\Windows\Sun\Java\bin;C:\Windows\system32;C:\Windows;C:\Program Files\Common Files\Microsoft Shared\Windows Live;C:\Program Files (x86)\Common Files\Microsoft Shared\Windows Live;F:\app\NESTORTECH\product\11.2.0\dbhome_1\bin;C:\Program Files (x86)\PC Connectivity Solution\;C:\Windows\system32;C:\Windows;C:\Windows\System32\Wbem;C:\Windows\System32\WindowsPowerShell\v1.0\;C:\ZendFramework-1.12.0\bin;C:\wamp\bin\php\php5.3.13;C:\Program Files (x86)\Windows Live\Shared;C:\Program Files\Microsoft SQL Server\110\Tools\Binn\;C:\Program Files (x86)\MySQL\MySQL Server 5.1\bin;C:\Program Files (x86)\QuickTime\QTSystem\;. mars 11, 2014 4:16:12 PM org.apache.coyote.http11.Http11Protocol init INFO: Initialisation de Coyote HTTP/1.1 sur http-8080 mars 11, 2014 4:16:12 PM org.apache.catalina.startup.Catalina load INFO: Initialization processed in 1810 ms mars 11, 2014 4:16:12 PM org.apache.catalina.core.StandardService start INFO: Démarrage du service Catalina mars 11, 2014 4:16:12 PM org.apache.catalina.core.StandardEngine start INFO: Starting Servlet Engine: Apache Tomcat/6.0.36 log4j:WARN No appenders could be found for logger (net.sf.ehcache.constructs.web.filter.Filter). log4j:WARN Please initialize the log4j system properly. 11/03/14 16:16:13 INFO [main] lutece.event - Starting application... 11/03/14 16:16:14 DEBUG [main] lutece.pool - property portal.driver 11/03/14 16:16:14 DEBUG [main] lutece.pool - pool name portal 11/03/14 16:16:14 DEBUG [main] lutece.pool - property portal.url 11/03/14 16:16:14 DEBUG [main] lutece.pool - pool name portal 11/03/14 16:16:14 DEBUG [main] lutece.pool - property portal.checkvalidconnectionsql 11/03/14 16:16:14 DEBUG [main] lutece.pool - pool name portal 11/03/14 16:16:14 DEBUG [main] lutece.pool - property portal.maxconns 11/03/14 16:16:14 DEBUG [main] lutece.pool - pool name portal 11/03/14 16:16:14 DEBUG [main] lutece.pool - property portal.poolservice 11/03/14 16:16:14 DEBUG [main] lutece.pool - pool name portal 11/03/14 16:16:14 DEBUG [main] lutece.pool - property portal.logintimeout 11/03/14 16:16:14 DEBUG [main] lutece.pool - pool name portal 11/03/14 16:16:14 DEBUG [main] lutece.pool - property portal.initconns 11/03/14 16:16:14 DEBUG [main] lutece.pool - pool name portal 11/03/14 16:16:14 DEBUG [main] lutece.pool - property portal.user 11/03/14 16:16:14 DEBUG [main] lutece.pool - pool name portal 11/03/14 16:16:14 DEBUG [main] lutece.pool - property portal.password 11/03/14 16:16:14 DEBUG [main] lutece.pool - pool name portal 11/03/14 16:16:14 INFO [main] lutece.pool - Registered JDBC driver org.gjt.mm.mysql.Driver 11/03/14 16:16:14 INFO [main] lutece.pool - New connection created. Connections count is : 1 11/03/14 16:16:14 INFO [main] lutece.pool - New connection created. Connections count is : 2 11/03/14 16:16:14 INFO [main] lutece.pool - New pool created : portal 11/03/14 16:16:14 DEBUG [main] lutece.pool - url=jdbc:mysql://localhost/transfusion?autoReconnect=true useUnicode=yes characterEncoding=utf8 user=root password=root initconns=2 maxconns=50 logintimeout=2 11/03/14 16:16:14 DEBUG [main] lutece.pool - Total connections: 2 Available: 2 Checked-out: 0 11/03/14 16:16:14 INFO [main] lutece.event - Creating connexions pool 'portal'. 11/03/14 16:16:15 INFO [main] lutece.event - Context file loaded : core_context.xml 11/03/14 16:16:15 INFO [main] lutece.event - Context file loaded : contact_context.xml 11/03/14 16:16:15 INFO [main] lutece.event - Context file loaded : database_context.xml 11/03/14 16:16:15 INFO [main] lutece.event - Context file loaded : document_context.xml 11/03/14 16:16:15 INFO [main] lutece.event - Context file loaded : html_context.xml 11/03/14 16:16:15 INFO [main] lutece.event - Context file loaded : jcaptcha_context.xml 11/03/14 16:16:15 INFO [main] lutece.event - Context file loaded : lucene_context.xml 11/03/14 16:16:15 INFO [main] lutece.event - Context file loaded : mylutece_context.xml 11/03/14 16:16:15 INFO [main] lutece.event - Context file loaded : newsletter_context.xml 11/03/14 16:16:15 INFO [main] lutece.event - Loading plugins context overrides 11/03/14 16:16:17 INFO [main] lutece.event - New ImageResourceType registered : fr.paris.lutece.portal.service.page.PageService 11/03/14 16:16:17 INFO [main] lutece.event - New Page Event Listener registered : fr.paris.lutece.portal.service.page.PageService mars 11, 2014 4:16:17 PM org.apache.catalina.core.ApplicationContext log SEVERE: StandardWrapper.Throwable java.lang.NoClassDefFoundError: org/apache/lucene/index/IndexableField at java.lang.Class.getDeclaredConstructors0(Native Method) at java.lang.Class.privateGetDeclaredConstructors(Unknown Source) at java.lang.Class.getDeclaredConstructors(Unknown Source) at org.springframework.beans.factory.annotation.AutowiredAnnotationBeanPostProcessor.determineCandidateConstructors(AutowiredAnnotationBeanPostProcessor.java:229) at org.springframework.beans.factory.support.AbstractAutowireCapableBeanFactory.determineConstructorsFromBeanPostProcessors(AbstractAutowireCapableBeanFactory.java:962) at org.springframework.beans.factory.support.AbstractAutowireCapableBeanFactory.createBeanInstance(AbstractAutowireCapableBeanFactory.java:935) at org.springframework.beans.factory.support.AbstractAutowireCapableBeanFactory.doCreateBean(AbstractAutowireCapableBeanFactory.java:485) at org.springframework.beans.factory.support.AbstractAutowireCapableBeanFactory.createBean(AbstractAutowireCapableBeanFactory.java:456) at org.springframework.beans.factory.support.AbstractBeanFactory$1.getObject(AbstractBeanFactory.java:294) at org.springframework.beans.factory.support.DefaultSingletonBeanRegistry.getSingleton(DefaultSingletonBeanRegistry.java:225) at org.springframework.beans.factory.support.AbstractBeanFactory.doGetBean(AbstractBeanFactory.java:291) at org.springframework.beans.factory.support.AbstractBeanFactory.getBean(AbstractBeanFactory.java:193) at org.springframework.beans.factory.support.DefaultListableBeanFactory.preInstantiateSingletons(DefaultListableBeanFactory.java:585) at org.springframework.context.support.AbstractApplicationContext.finishBeanFactoryInitialization(AbstractApplicationContext.java:913) at org.springframework.context.support.AbstractApplicationContext.refresh(AbstractApplicationContext.java:464) at fr.paris.lutece.portal.service.spring.SpringContextService.init(SpringContextService.java:175) at fr.paris.lutece.portal.service.init.AppInit.initServices(AppInit.java:132) at fr.paris.lutece.portal.service.init.AppInitServlet.init(AppInitServlet.java:80) at org.apache.catalina.core.StandardWrapper.loadServlet(StandardWrapper.java:1206) at org.apache.catalina.core.StandardWrapper.load(StandardWrapper.java:1026) at org.apache.catalina.core.StandardContext.loadOnStartup(StandardContext.java:4421) at org.apache.catalina.core.StandardContext.start(StandardContext.java:4734) at org.apache.catalina.core.ContainerBase.start(ContainerBase.java:1057) at org.apache.catalina.core.StandardHost.start(StandardHost.java:840) at org.apache.catalina.core.ContainerBase.start(ContainerBase.java:1057) at org.apache.catalina.core.StandardEngine.start(StandardEngine.java:463) at org.apache.catalina.core.StandardService.start(StandardService.java:525) at org.apache.catalina.core.StandardServer.start(StandardServer.java:754) at org.apache.catalina.startup.Catalina.start(Catalina.java:595) at sun.reflect.NativeMethodAccessorImpl.invoke0(Native Method) at sun.reflect.NativeMethodAccessorImpl.invoke(Unknown Source) at sun.reflect.DelegatingMethodAccessorImpl.invoke(Unknown Source) at java.lang.reflect.Method.invoke(Unknown Source) at org.apache.catalina.startup.Bootstrap.start(Bootstrap.java:289) at org.apache.catalina.startup.Bootstrap.main(Bootstrap.java:414) Caused by: java.lang.ClassNotFoundException: org.apache.lucene.index.IndexableField at org.apache.catalina.loader.WebappClassLoader.loadClass(WebappClassLoader.java:1680) at org.apache.catalina.loader.WebappClassLoader.loadClass(WebappClassLoader.java:1526) ... 35 more mars 11, 2014 4:16:17 PM org.apache.catalina.core.StandardContext loadOnStartup SEVERE: La servlet /transfusion a généré une exception load() java.lang.ClassNotFoundException: org.apache.lucene.index.IndexableField at org.apache.catalina.loader.WebappClassLoader.loadClass(WebappClassLoader.java:1680) at org.apache.catalina.loader.WebappClassLoader.loadClass(WebappClassLoader.java:1526) at java.lang.Class.getDeclaredConstructors0(Native Method) at java.lang.Class.privateGetDeclaredConstructors(Unknown Source) at java.lang.Class.getDeclaredConstructors(Unknown Source) at org.springframework.beans.factory.annotation.AutowiredAnnotationBeanPostProcessor.determineCandidateConstructors(AutowiredAnnotationBeanPostProcessor.java:229) at org.springframework.beans.factory.support.AbstractAutowireCapableBeanFactory.determineConstructorsFromBeanPostProcessors(AbstractAutowireCapableBeanFactory.java:962) at org.springframework.beans.factory.support.AbstractAutowireCapableBeanFactory.createBeanInstance(AbstractAutowireCapableBeanFactory.java:935) at org.springframework.beans.factory.support.AbstractAutowireCapableBeanFactory.doCreateBean(AbstractAutowireCapableBeanFactory.java:485) at org.springframework.beans.factory.support.AbstractAutowireCapableBeanFactory.createBean(AbstractAutowireCapableBeanFactory.java:456) at org.springframework.beans.factory.support.AbstractBeanFactory$1.getObject(AbstractBeanFactory.java:294) at org.springframework.beans.factory.support.DefaultSingletonBeanRegistry.getSingleton(DefaultSingletonBeanRegistry.java:225) at org.springframework.beans.factory.support.AbstractBeanFactory.doGetBean(AbstractBeanFactory.java:291) at org.springframework.beans.factory.support.AbstractBeanFactory.getBean(AbstractBeanFactory.java:193) at org.springframework.beans.factory.support.DefaultListableBeanFactory.preInstantiateSingletons(DefaultListableBeanFactory.java:585) at org.springframework.context.support.AbstractApplicationContext.finishBeanFactoryInitialization(AbstractApplicationContext.java:913) at org.springframework.context.support.AbstractApplicationContext.refresh(AbstractApplicationContext.java:464) at fr.paris.lutece.portal.service.spring.SpringContextService.init(SpringContextService.java:175) at fr.paris.lutece.portal.service.init.AppInit.initServices(AppInit.java:132) at fr.paris.lutece.portal.service.init.AppInitServlet.init(AppInitServlet.java:80) at org.apache.catalina.core.StandardWrapper.loadServlet(StandardWrapper.java:1206) at org.apache.catalina.core.StandardWrapper.load(StandardWrapper.java:1026) at org.apache.catalina.core.StandardContext.loadOnStartup(StandardContext.java:4421) at org.apache.catalina.core.StandardContext.start(StandardContext.java:4734) at org.apache.catalina.core.ContainerBase.start(ContainerBase.java:1057) at org.apache.catalina.core.StandardHost.start(StandardHost.java:840) at org.apache.catalina.core.ContainerBase.start(ContainerBase.java:1057) at org.apache.catalina.core.StandardEngine.start(StandardEngine.java:463) at org.apache.catalina.core.StandardService.start(StandardService.java:525) at org.apache.catalina.core.StandardServer.start(StandardServer.java:754) at org.apache.catalina.startup.Catalina.start(Catalina.java:595) at sun.reflect.NativeMethodAccessorImpl.invoke0(Native Method) at sun.reflect.NativeMethodAccessorImpl.invoke(Unknown Source) at sun.reflect.DelegatingMethodAccessorImpl.invoke(Unknown Source) at java.lang.reflect.Method.invoke(Unknown Source) at org.apache.catalina.startup.Bootstrap.start(Bootstrap.java:289) at org.apache.catalina.startup.Bootstrap.main(Bootstrap.java:414) mars 11, 2014 4:16:17 PM org.apache.coyote.http11.Http11Protocol start INFO: Démarrage de Coyote HTTP/1.1 sur http-8080 mars 11, 2014 4:16:17 PM org.apache.jk.common.ChannelSocket init INFO: JK: ajp13 listening on /0.0.0.0:8009 mars 11, 2014 4:16:17 PM org.apache.jk.server.JkMain start INFO: Jk running ID=0 time=0/70 config=null mars 11, 2014 4:16:17 PM org.apache.catalina.startup.Catalina start INFO: Server startup in 5468 ms 11/03/14 16:17:09 DEBUG [http-8080-1] lutece.cache - Initializing cache : PageCachingFilter 11/03/14 16:17:13 DEBUG [http-8080-1] lutece.cache - Initializing cache : StaticFilesCachingFilter 11/03/14 16:17:13 DEBUG [http-8080-1] lutece.cache - URI served from cache : /transfusion/css/page_template_structure.css 11/03/14 16:17:20 DEBUG [http-8080-1] lutece.cache - URI served from cache : /transfusion/css/page_template_structure.css

: JGO
Quelle est la version du core utilisée ? Quel est le résultat de la commande mvn dependency:tree ?

 

 

annamir
La version du core est 3.1.6 le résultat de la commande mvn dependency:tree [INFO] fr.paris.lutece:Transfusion:lutece-site:2.0 [INFO] +- fr.paris.lutece:lutece-core:lutece-core:3.1.6:compile [INFO] | +- javax.activation:activation:jar:1.1:compile [INFO] | +- c3p0:c3p0:jar:0.9.1.2:compile [INFO] | +- commons-beanutils:commons-beanutils:jar:1.7.0:compile [INFO] | | \- commons-logging:commons-logging:jar:1.0.3:compile [INFO] | +- commons-digester:commons-digester:jar:1.8.1:compile [INFO] | +- commons-fileupload:commons-fileupload:jar:1.2.2:compile [INFO] | +- commons-httpclient:commons-httpclient:jar:3.1:compile [INFO] | | \- commons-codec:commons-codec:jar:1.2:compile [INFO] | +- commons-io:commons-io:jar:1.4:compile [INFO] | +- commons-lang:commons-lang:jar:2.3:compile [INFO] | +- commons-dbcp:commons-dbcp:jar:1.2.2:compile [INFO] | | \- commons-pool:commons-pool:jar:1.3:compile [INFO] | +- net.sf.ehcache:ehcache-core:jar:2.4.0:compile [INFO] | +- net.sf.ehcache:ehcache-web:jar:2.0.3:compile [INFO] | +- org.slf4j:slf4j-api:jar:1.6.1:compile [INFO] | +- org.slf4j:slf4j-log4j12:jar:1.6.1:compile [INFO] | +- jtidy:jtidy:jar:8.0:compile [INFO] | +- log4j:log4j:jar:1.2.13:compile [INFO] | +- javax.mail:mail:jar:1.4:compile [INFO] | +- mysql:mysql-connector-java:jar:5.1.18:compile [INFO] | +- org.springframework:spring-aop:jar:3.1.0.RELEASE:compile [INFO] | | +- aopalliance:aopalliance:jar:1.0:compile [INFO] | | \- org.springframework:spring-asm:jar:3.1.0.RELEASE:compile [INFO] | +- org.springframework:spring-beans:jar:3.1.0.RELEASE:compile [INFO] | +- org.springframework:spring-context:jar:3.1.0.RELEASE:compile [INFO] | | \- org.springframework:spring-expression:jar:3.1.0.RELEASE:compile [INFO] | +- org.springframework:spring-core:jar:3.1.0.RELEASE:compile [INFO] | +- org.springframework:spring-orm:jar:3.1.0.RELEASE:compile [INFO] | | \- org.springframework:spring-jdbc:jar:3.1.0.RELEASE:compile [INFO] | +- org.springframework:spring-tx:jar:3.1.0.RELEASE:compile [INFO] | +- org.springframework:spring-web:jar:3.1.0.RELEASE:compile [INFO] | +- opensymphony:quartz:jar:1.6.3:compile [INFO] | +- fr.paris.lutece.plugins:library-lucene:lutece-plugin:1.0.5:compile [INFO] | | +- org.apache.lucene:lucene-core:jar:2.9.3:compile [INFO] | | +- org.apache.lucene:lucene-highlighter:jar:2.9.3:compile [INFO] | | +- org.apache.lucene:lucene-queries:jar:2.9.3:compile [INFO] | | +- org.apache.lucene:lucene-snowball:jar:2.9.3:compile [INFO] | | +- org.apache.lucene:lucene-memory:jar:2.9.3:compile [INFO] | | +- org.apache.lucene:lucene-misc:jar:2.9.3:compile [INFO] | | +- org.apache.lucene:lucene-spellchecker:jar:2.9.3:compile [INFO] | | +- org.apache.lucene:lucene-demos:jar:2.9.3:compile [INFO] | | +- org.apache.lucene:lucene-analyzers:jar:2.9.3:compile [INFO] | | +- org.apache.pdfbox:pdfbox:jar:1.5.0:compile [INFO] | | | +- org.apache.pdfbox:fontbox:jar:1.5.0:compile [INFO] | | | \- org.apache.pdfbox:jempbox:jar:1.5.0:compile [INFO] | | +- org.apache.tika:tika-core:jar:0.7:compile [INFO] | | \- org.apache.tika:tika-parsers:jar:0.7:compile [INFO] | | +- org.apache.commons:commons-compress:jar:1.0:compile [INFO] | | +- org.bouncycastle:bcmail-jdk15:jar:1.45:compile [INFO] | | +- org.bouncycastle:bcprov-jdk15:jar:1.45:compile [INFO] | | +- org.apache.poi:poi:jar:3.6:compile [INFO] | | +- org.apache.poi:poi-scratchpad:jar:3.6:compile [INFO] | | +- org.apache.poi:poi-ooxml:jar:3.6:compile [INFO] | | | +- org.apache.poi:poi-ooxml-schemas:jar:3.6:compile [INFO] | | | | \- org.apache.xmlbeans:xmlbeans:jar:2.3.0:compile [INFO] | | | \- dom4j:dom4j:jar:1.6.1:compile [INFO] | | | \- xml-apis:xml-apis:jar:1.0.b2:compile [INFO] | | +- org.apache.geronimo.specs:geronimo-stax-api_1.0_spec:jar:1.0.1:compile [INFO] | | +- org.ccil.cowan.tagsoup:tagsoup:jar:1.2:compile [INFO] | | +- asm:asm:jar:3.1:compile [INFO] | | \- com.drewnoakes:metadata-extractor:jar:2.4.0-beta-1:compile [INFO] | +- fr.paris.lutece.plugins:library-rbac-api:jar:1.0.0:compile [INFO] | +- fr.paris.lutece.plugins:library-workgroup-api:jar:1.0.0:compile [INFO] | +- fr.paris.lutece.plugins:library-freemarker:jar:1.0.0:compile [INFO] | | \- org.freemarker:freemarker:jar:2.3.18:compile [INFO] | +- fr.paris.lutece.plugins:library-workflow-core:jar:1.0.1:compile [INFO] | +- org.apache.geronimo.specs:geronimo-jpa_2.0_spec:jar:1.0:compile [INFO] | +- net.sf.scannotation:scannotation:jar:1.0.2:compile [INFO] | | \- javassist:javassist:jar:3.6.0.GA:compile [INFO] | +- net.sf.json-lib:json-lib:jar:jdk15:2.4:compile [INFO] | | +- commons-collections:commons-collections:jar:3.2.1:compile [INFO] | | \- net.sf.ezmorph:ezmorph:jar:1.0.6:compile [INFO] | +- javax.inject:javax.inject:jar:1:compile [INFO] | +- javax.validation:validation-api:jar:1.0.0.GA:compile [INFO] | +- org.hibernate:hibernate-validator:jar:4.2.0.Final:compile [INFO] | \- net.sf.dozer:dozer:jar:5.3.2:compile [INFO] +- fr.paris.lutece.plugins:plugin-html:lutece-plugin:2.1.3:compile [INFO] +- fr.paris.lutece.plugins:plugin-newsletter:lutece-plugin:2.2.10-SNAPSHOT:compile [INFO] | +- fr.paris.lutece.plugins:plugin-document:lutece-plugin:3.1.2-SNAPSHOT:compile (version selected from constraint [2.0.14,5.0.0-SNAPSHOT)) [INFO] | | \- org.imgscalr:imgscalr-lib:jar:4.1:compile [INFO] | +- net.sf.opencsv:opencsv:jar:1.8:compile [INFO] | \- jakarta-regexp:jakarta-regexp:jar:1.4:compile [INFO] +- fr.paris.lutece.plugins:plugin-client:lutece-plugin:0.0.1-SNAPSHOT:compile [INFO] +- fr.paris.lutece.plugins:plugin-upload:lutece-plugin:1.0.2-SNAPSHOT:compile [INFO] +- fr.paris.lutece.plugins:plugin-livreblanc:lutece-plugin:1.0.0-SNAPSHOT:compile [INFO] +- fr.paris.lutece.plugins:plugin-article:lutece-plugin:1.0.0-SNAPSHOT:compile [INFO] +- fr.paris.lutece.plugins:plugin-home:lutece-plugin:1.0.0-SNAPSHOT:compile [INFO] +- fr.paris.lutece.plugins:plugin-search:lutece-plugin:1.0.0-SNAPSHOT:compile [INFO] +- fr.paris.lutece.plugins:plugin-jcaptcha:lutece-plugin:2.1.5-SNAPSHOT:compile [INFO] | +- com.octo.captcha:jcaptcha:jar:1.0:compile [INFO] | | +- com.octo.captcha:jcaptcha-api:jar:1.0:compile [INFO] | | \- com.jhlabs:imaging:jar:01012005:compile [INFO] | +- com.octo.captcha:jcaptcha-extension-buffered-engine:jar:1.0:compile [INFO] | | \- concurrent:concurrent:jar:1.3.4:compile [INFO] | +- tritonus:tritonus-share:jar:0.3.6:compile [INFO] | \- tritonus:tritonus-dsp:jar:0.3.6:compile [INFO] +- fr.paris.lutece.plugins:plugin-contact:lutece-plugin:2.1.4:compile [INFO] +- fr.paris.lutece.plugins:plugin-uploadimage:lutece-plugin:1.0.2-SNAPSHOT:compile [INFO] +- fr.paris.lutece.plugins:plugin-etat:lutece-plugin:1.0.0-SNAPSHOT:compile [INFO] +- fr.paris.lutece.plugins:plugin-plansite:lutece-plugin:1.0.1-SNAPSHOT:compile [INFO] +- fr.paris.lutece.plugins:plugin-carte:lutece-plugin:1.0.0-SNAPSHOT:compile [INFO] +- fr.paris.lutece.plugins:plugin-evenement:lutece-plugin:1.0.0-SNAPSHOT:compile [INFO] +- javax.servlet:servlet-api:jar:2.4:provided [INFO] +- javax.servlet:jsp-api:jar:2.0:provided [INFO] +- fr.paris.lutece.plugins:library-lutece-unit-testing:jar:2.0.6:test [INFO] \- junit:junit:jar:4.8.1:test

: JGO
La version snapshot du plugin newsletter n'existe plus, mieux vaut utiliser la dernière version snapshot ou une version tagguée compatile avec le coeur 3.1.6. La version utilisée du plugin document n'est pas compatible avec le coeur 3.1.6, il faut utiliser la dernière version tagguée. JGO

 

 

annamir
J'ai assemblé le site. Mais il est impossible d'intervenir sur le contenu d'une page, l'erreur suivant s'affiche Erreur Cette page n'existe pas ! Aussi le menu n'est pas affiché Quoi faire?

 

annamir
: JGO
Quelle est l'URL qui retourne cette erreur ? Quelle est le scénario qui aboutit à ce message ? Y-a-t'il une trace d'erreur dans la log ?

 

annamir
L'urls des plugins que j'ai installé manuellement Ci-dessous le résultat du goal site-assembly: [INFO] Scanning for projects... [WARNING] [WARNING] Some problems were encountered while building the effective model for fr.paris.lutece:Transfusion:lutece-site:2.0 [WARNING] 'build.plugins.plugin.version' for fr.paris.lutece.tools:maven-lutece-plugin is missing. @ fr.paris.lutece:lutece-parent-pom:2.28, C:\Users\NESTORTECH\.m2\repository\fr\paris\lutece\lutece-parent-pom\2.28\lutece-parent-pom-2.28.pom, line 61, column 21 [WARNING] 'build.plugins.plugin.version' for org.codehaus.mojo:cobertura-maven-plugin is missing. @ fr.paris.lutece:lutece-parent-pom:2.28, C:\Users\NESTORTECH\.m2\repository\fr\paris\lutece\lutece-parent-pom\2.28\lutece-parent-pom-2.28.pom, line 101, column 21 [WARNING] 'build.plugins.plugin.version' for org.apache.maven.plugins:maven-compiler-plugin is missing. @ fr.paris.lutece:lutece-parent-pom:2.28, C:\Users\NESTORTECH\.m2\repository\fr\paris\lutece\lutece-parent-pom\2.28\lutece-parent-pom-2.28.pom, line 69, column 21 [WARNING] 'build.plugins.plugin.version' for org.apache.maven.plugins:maven-surefire-plugin is missing. @ fr.paris.lutece:lutece-parent-pom:2.28, C:\Users\NESTORTECH\.m2\repository\fr\paris\lutece\lutece-parent-pom\2.28\lutece-parent-pom-2.28.pom, line 84, column 21 [WARNING] 'build.plugins.plugin.version' for org.apache.maven.plugins:maven-surefire-report-plugin is missing. @ fr.paris.lutece:lutece-parent-pom:2.28, C:\Users\NESTORTECH\.m2\repository\fr\paris\lutece\lutece-parent-pom\2.28\lutece-parent-pom-2.28.pom, line 111, column 21 [WARNING] [WARNING] It is highly recommended to fix these problems because they threaten the stability of your build. [WARNING] [WARNING] For this reason, future Maven versions might no longer support building such malformed projects. [WARNING] [INFO] [INFO] ------------------------------------------------------------------------ [INFO] Building Portail transfusion 2.0 [INFO] ------------------------------------------------------------------------ [WARNING] The POM for opensymphony:quartz:jar:1.6.0 is missing, no dependency information available [WARNING] The POM for fr.paris.lutece.plugins:library-rbac-api:jar:1.0.0-SNAPSHOT is missing, no dependency information available [WARNING] The POM for fr.paris.lutece.plugins:library-workgroup-api:jar:1.0.0-SNAPSHOT is missing, no dependency information available [WARNING] The POM for fr.paris.lutece.plugins:library-freemarker:jar:1.0.0-SNAPSHOT is missing, no dependency information available [WARNING] The POM for fr.paris.lutece.plugins:library-workflow-core:jar:1.0.0-SNAPSHOT is missing, no dependency information available [INFO] [INFO] --- maven-lutece-plugin:3.0.1:site-assembly (default-cli) @ Transfusion --- [INFO] Assembly-site lutece-site artifact... [INFO] Exploding webapp in F:\transfusion\transfusion\target\Transfusion-2.0... [INFO] Copying webapp files [WARNING] Default configuration directory F:\transfusion\transfusion\src\conf\default does not exist [INFO] Local configuration directory is C:\Users\NESTORTECH\lutece\conf\Transfusion [WARNING] Local configuration directory C:\Users\NESTORTECH\lutece\conf\Transfusion does not exist [INFO] Building jar: F:\transfusion\transfusion\target\Transfusion-2.0.war [INFO] ------------------------------------------------------------------------ [INFO] BUILD SUCCESS [INFO] ------------------------------------------------------------------------ [INFO] Total time: 41.622s [INFO] Finished at: Fri Mar 14 10:11:17 GMT 2014 [INFO] Final Memory: 17M/255M [INFO] ------------------------------------------------------------------------

: JGO
Dans le navigateur, quelle est l'URL qui affiche cette erreur ? Quelle est la page qui aboutit à ce message (page d'accueil, clic sur un bouton) ? Y-a-t'il une trace d'erreur dans la log du serveur (tomcat) ?

 

annamir
Voila l'url: http://127.0.0.1:8080/lutece/jsp/admin/plugins/evenement/ManageEventHome.jsp?plugin_name=evenement C'est dans l'espace admin lorsque je clique sur le lien du plugin evenement insallé manuellement Pas de log dans le serveur tomcat