Forum Lutèce

nestor-systeme
 6  7580
6

Problème lors de l'execution du goal lutece:exploded

Problème lors de l'execution du goal lutece:exploded

Ci dessous le problème:

[INFO] Scanning for projects...
[INFO] ------------------------------------------------------------------------
[INFO] Building Portail transfusion
[INFO]    task-segment: [lutece:exploded]
[INFO] ------------------------------------------------------------------------
[INFO] Preparing lutece:exploded
[INFO] No goals needed for project - skipping
-----------------------------------------------------
this realm = app0.child-container[fr.paris.lutece.tools:maven-lutece-plugin:3.0.1]
urls[0] = file:/C:/Users/NESTORTECH/.m2/repository/fr/paris/lutece/tools/maven-lutece-plugin/3.0.1/maven-lutece-plugin-3.0.1.jar
urls[1] = file:/C:/Users/NESTORTECH/.m2/repository/org/codehaus/plexus/plexus-utils/3.0.8/plexus-utils-3.0.8.jar
urls[2] = file:/C:/Users/NESTORTECH/.m2/repository/org/codehaus/plexus/plexus-component-annotations/1.5.5/plexus-component-annotations-1.5.5.jar
urls[3] = file:/C:/Users/NESTORTECH/.m2/repository/org/codehaus/plexus/plexus-classworlds/2.4/plexus-classworlds-2.4.jar
urls[4] = file:/C:/Users/NESTORTECH/.m2/repository/org/apache/maven/maven-compat/3.0.4/maven-compat-3.0.4.jar
urls[5] = file:/C:/Users/NESTORTECH/.m2/repository/org/apache/maven/maven-model-builder/3.0.4/maven-model-builder-3.0.4.jar
urls[6] = file:/C:/Users/NESTORTECH/.m2/repository/org/sonatype/plexus/plexus-sec-dispatcher/1.3/plexus-sec-dispatcher-1.3.jar
urls[7] = file:/C:/Users/NESTORTECH/.m2/repository/org/sonatype/plexus/plexus-cipher/1.7/plexus-cipher-1.7.jar
urls[8] = file:/C:/Users/NESTORTECH/.m2/repository/org/apache/maven/maven-embedder/3.0.4/maven-embedder-3.0.4.jar
urls[9] = file:/C:/Users/NESTORTECH/.m2/repository/commons-cli/commons-cli/1.2/commons-cli-1.2.jar
urls[10] = file:/C:/Users/NESTORTECH/.m2/repository/org/codehaus/plexus/plexus-archiver/2.2/plexus-archiver-2.2.jar
urls[11] = file:/C:/Users/NESTORTECH/.m2/repository/org/codehaus/plexus/plexus-io/2.0.4/plexus-io-2.0.4.jar
urls[12] = file:/C:/Users/NESTORTECH/.m2/repository/org/apache/maven/maven-archiver/2.5/maven-archiver-2.5.jar
urls[13] = file:/C:/Users/NESTORTECH/.m2/repository/org/apache/maven/shared/file-management/1.2.1/file-management-1.2.1.jar
urls[14] = file:/C:/Users/NESTORTECH/.m2/repository/org/apache/maven/shared/maven-shared-io/1.1/maven-shared-io-1.1.jar
urls[15] = file:/C:/Users/NESTORTECH/.m2/repository/org/apache/maven/plugins/maven-clean-plugin/2.4.1/maven-clean-plugin-2.4.1.jar
urls[16] = file:/C:/Users/NESTORTECH/.m2/repository/commons-io/commons-io/1.4/commons-io-1.4.jar
Number of imports: 10
import: org.codehaus.classworlds.Entry@a6c57a42
import: org.codehaus.classworlds.Entry@12f43f3b
import: org.codehaus.classworlds.Entry@20025374
import: org.codehaus.classworlds.Entry@f8e44ca4
import: org.codehaus.classworlds.Entry@92758522
import: org.codehaus.classworlds.Entry@ebf2705b
import: org.codehaus.classworlds.Entry@bb25e54
import: org.codehaus.classworlds.Entry@bece5185
import: org.codehaus.classworlds.Entry@3fee8e37
import: org.codehaus.classworlds.Entry@3fee19d8


this realm = plexus.core
urls[0] = file:/C:/LuteceEnvironnement/apache-maven-2.2.1/bin/../lib/maven-2.2.1-uber.jar
urls[1] = file:/C:/Users/NESTORTECH/.m2/repository/fr/paris/lutece/tools/build-tools/0.11/build-tools-0.11.jar
Number of imports: 10
import: org.codehaus.classworlds.Entry@a6c57a42
import: org.codehaus.classworlds.Entry@12f43f3b
import: org.codehaus.classworlds.Entry@20025374
import: org.codehaus.classworlds.Entry@f8e44ca4
import: org.codehaus.classworlds.Entry@92758522
import: org.codehaus.classworlds.Entry@ebf2705b
import: org.codehaus.classworlds.Entry@bb25e54
import: org.codehaus.classworlds.Entry@bece5185
import: org.codehaus.classworlds.Entry@3fee8e37
import: org.codehaus.classworlds.Entry@3fee19d8
-----------------------------------------------------
[INFO] ------------------------------------------------------------------------
[ERROR] BUILD ERROR
[INFO] ------------------------------------------------------------------------
[INFO] Internal error in the plugin manager executing goal 'fr.paris.lutece.tools:maven-lutece-plugin:3.0.1:exploded': Unable to load the mojo 'fr.paris.lutece.tools:maven-lutece-plugin:3.0.1:exploded' in the plugin 'fr.paris.lutece.tools:maven-lutece-plugin'. A required class is missing: org/apache/maven/repository/legacy/metadata/ArtifactMetadataRetrievalException
org.apache.maven.repository.legacy.metadata.ArtifactMetadataRetrievalException
[INFO] ------------------------------------------------------------------------
[INFO] For more information, run Maven with the -e switch
[INFO] ------------------------------------------------------------------------
[INFO] Total time: 3 seconds
[INFO] Finished at: Tue Mar 04 15:37:58 GMT 2014
[INFO] Final Memory: 34M/253M
[INFO] ------------------------------------------------------------------------

JGO
La stack indique que vous utilisez un maven 2 apache-maven-2.2.1. Il faut utiliser un maven 3. JGO

 

nestor-systeme
Merci pour votre reponse En utilisant maven 3, j'ai l'erreur suivant sachant que j'ai tout les jars dans le répertoire lib: [INFO] Scanning for projects... [WARNING] [WARNING] Some problems were encountered while building the effective model for fr.paris.lutece:Transfusion:lutece-site:2.0 [WARNING] 'dependencies.dependency.systemPath' for fr.paris.lutece.plugins:plugin-upload:jar should not point at files within the project directory, ${project.basedir}\lib\plugin-upload-1.0.2-SNAPSHOT.jar will be unresolvable by dependent projects @ line 51, column 19 [WARNING] 'dependencies.dependency.systemPath' for fr.paris.lutece.plugins:plugin-livreblanc:jar should not point at files within the project directory, ${project.basedir}\lib\plugin-livreblanc-1.0.0-SNAPSHOT.jar will be unresolvable by dependent projects @ line 59, column 18 [WARNING] 'dependencies.dependency.systemPath' for fr.paris.lutece.plugins:plugin-article:jar should not point at files within the project directory, ${project.basedir}\lib\plugin-article-1.0.0-SNAPSHOT.jar will be unresolvable by dependent projects @ line 67, column 18 [WARNING] 'dependencies.dependency.systemPath' for fr.paris.lutece.plugins:plugin-search:jar should not point at files within the project directory, ${project.basedir}\lib\plugin-search-1.0.0-SNAPSHOT.jar will be unresolvable by dependent projects @ line 75, column 19 [WARNING] 'dependencies.dependency.systemPath' for fr.paris.lutece.plugins:plugin-uploadimage:jar should not point at files within the project directory, ${project.basedir}\lib\plugin-uploadimage-1.0.2-SNAPSHOT.jar will be unresolvable by dependent projects @ line 97, column 20 [WARNING] 'build.plugins.plugin.version' for fr.paris.lutece.tools:maven-lutece-plugin is missing. @ fr.paris.lutece:lutece-parent-pom:2.28, C:\Users\NESTORTECH\.m2\repository\fr\paris\lutece\lutece-parent-pom\2.28\lutece-parent-pom-2.28.pom, line 61, column 21 [WARNING] 'build.plugins.plugin.version' for org.codehaus.mojo:cobertura-maven-plugin is missing. @ fr.paris.lutece:lutece-parent-pom:2.28, C:\Users\NESTORTECH\.m2\repository\fr\paris\lutece\lutece-parent-pom\2.28\lutece-parent-pom-2.28.pom, line 101, column 21 [WARNING] 'build.plugins.plugin.version' for org.apache.maven.plugins:maven-compiler-plugin is missing. @ fr.paris.lutece:lutece-parent-pom:2.28, C:\Users\NESTORTECH\.m2\repository\fr\paris\lutece\lutece-parent-pom\2.28\lutece-parent-pom-2.28.pom, line 69, column 21 [WARNING] 'build.plugins.plugin.version' for org.apache.maven.plugins:maven-surefire-plugin is missing. @ fr.paris.lutece:lutece-parent-pom:2.28, C:\Users\NESTORTECH\.m2\repository\fr\paris\lutece\lutece-parent-pom\2.28\lutece-parent-pom-2.28.pom, line 84, column 21 [WARNING] 'build.plugins.plugin.version' for org.apache.maven.plugins:maven-surefire-report-plugin is missing. @ fr.paris.lutece:lutece-parent-pom:2.28, C:\Users\NESTORTECH\.m2\repository\fr\paris\lutece\lutece-parent-pom\2.28\lutece-parent-pom-2.28.pom, line 111, column 21 [WARNING] [WARNING] It is highly recommended to fix these problems because they threaten the stability of your build. [WARNING] [WARNING] For this reason, future Maven versions might no longer support building such malformed projects. [WARNING] [INFO] [INFO] ------------------------------------------------------------------------ [INFO] Building Portail transfusion 2.0 [INFO] ------------------------------------------------------------------------ [INFO] [INFO] maven-lutece-plugin:3.0.1:exploded (default-cli) @ Transfusion [INFO] [INFO]maven-lutece-plugin:3.0.1:exploded (default-cli) @ Transfusion [WARNING] The POM for opensymphony:quartz:jar:1.6.0 is missing, no dependency information available [WARNING] The POM for fr.paris.lutece.plugins:library-rbac-api:jar:1.0.0-SNAPSHOT is missing, no dependency information available [WARNING] The POM for fr.paris.lutece.plugins:library-workgroup-api:jar:1.0.0-SNAPSHOT is missing, no dependency information available [WARNING] The POM for fr.paris.lutece.plugins:library-freemarker:jar:1.0.0-SNAPSHOT is missing, no dependency information available [WARNING] The POM for fr.paris.lutece.plugins:library-workflow-core:jar:1.0.0-SNAPSHOT is missing, no dependency information available [INFO] ------------------------------------------------------------------------ [INFO] BUILD FAILURE [INFO] ------------------------------------------------------------------------ [INFO] Total time: 3.577s [INFO] Finished at: Tue Mar 04 17:38:36 GMT 2014 [INFO] Final Memory: 15M/176M [INFO] ------------------------------------------------------------------------ [ERROR] Failed to execute goal on project Transfusion: Could not resolve dependencies for project fr.paris.lutece:Transfusion:lutece-site:2.0: Failed to collect dependencies for fr.paris.lutece:Transfusion:lutece-site:2.0: Could not resolve version conflict among [fr.paris.lutece:lutece-core:jar:3.1.6, fr.paris.lutece.plugins:plugin-html:jar:2.1.3 - fr.paris.lutece:lutece-core:jar:[2.3.0,4.0.0-SNAPSHOT), fr.paris.lutece.plugins:plugin-newsletter:jar:2.2.10-SNAPSHOT - fr.paris.lutece:lutece-core:jar:[2.3.0,5.0.0-SNAPSHOT), fr.paris.lutece.plugins:plugin-newsletter:jar:2.2.10-SNAPSHOT - fr.paris.lutece.plugins:plugin-document:jar:[2.0.14,5.0.0-SNAPSHOT) - fr.paris.lutece:lutece-core:jar:[4.1.0-SNAPSHOT,5.0.0-SNAPSHOT), fr.paris.lutece.plugins:plugin-jcaptcha:jar:2.1.5-SNAPSHOT - fr.paris.lutece:lutece-core:jar:[2.4.0,5.0.0-SNAPSHOT), fr.paris.lutece.plugins:plugin-contact:jar:2.1.4 - fr.paris.lutece:lutece-core:jar:[2.3.1,4.0.0-SNAPSHOT), fr.paris.lutece.plugins:library-lutece-unit-testing:jar:2.0.6 - fr.paris.lutece:lutece-core:jar:RELEASE] - [Help 1] [ERROR] [ERROR] To see the full stack trace of the errors, re-run Maven with the -e switch. [ERROR] Re-run Maven using the -X switch to enable full debug logging. [ERROR] [ERROR] For more information about the errors and possible solutions, please read the following articles: [ERROR] [Help 1] http://cwiki.apache.org/confluence/display/MAVEN/DependencyResolutionException

 

nestor-systeme
Maintenant j'ai le problème suivant: [INFO] Scanning for projects... [WARNING] [WARNING] Some problems were encountered while building the effective model for fr.paris.lutece:Transfusion:lutece-site:2.0 [WARNING] 'build.plugins.plugin.version' for fr.paris.lutece.tools:maven-lutece-plugin is missing. @ fr.paris.lutece:lutece-parent-pom:2.28, C:\Users\NESTORTECH\.m2\repository\fr\paris\lutece\lutece-parent-pom\2.28\lutece-parent-pom-2.28.pom, line 61, column 21 [WARNING] 'build.plugins.plugin.version' for org.codehaus.mojo:cobertura-maven-plugin is missing. @ fr.paris.lutece:lutece-parent-pom:2.28, C:\Users\NESTORTECH\.m2\repository\fr\paris\lutece\lutece-parent-pom\2.28\lutece-parent-pom-2.28.pom, line 101, column 21 [WARNING] 'build.plugins.plugin.version' for org.apache.maven.plugins:maven-compiler-plugin is missing. @ fr.paris.lutece:lutece-parent-pom:2.28, C:\Users\NESTORTECH\.m2\repository\fr\paris\lutece\lutece-parent-pom\2.28\lutece-parent-pom-2.28.pom, line 69, column 21 [WARNING] 'build.plugins.plugin.version' for org.apache.maven.plugins:maven-surefire-plugin is missing. @ fr.paris.lutece:lutece-parent-pom:2.28, C:\Users\NESTORTECH\.m2\repository\fr\paris\lutece\lutece-parent-pom\2.28\lutece-parent-pom-2.28.pom, line 84, column 21 [WARNING] 'build.plugins.plugin.version' for org.apache.maven.plugins:maven-surefire-report-plugin is missing. @ fr.paris.lutece:lutece-parent-pom:2.28, C:\Users\NESTORTECH\.m2\repository\fr\paris\lutece\lutece-parent-pom\2.28\lutece-parent-pom-2.28.pom, line 111, column 21 [WARNING] [WARNING] It is highly recommended to fix these problems because they threaten the stability of your build. [WARNING] [WARNING] For this reason, future Maven versions might no longer support building such malformed projects. [WARNING] [INFO] [INFO] ------------------------------------------------------------------------ [INFO] Building Portail transfusion 2.0 [INFO] ------------------------------------------------------------------------ [INFO] [INFO] maven-lutece-plugin:3.0.1:exploded (default-cli) @ Transfusion [INFO] [INFO] maven-lutece-plugin:3.0.1:exploded (default-cli) @ Transfusion [WARNING] The POM for opensymphony:quartz:jar:1.6.0 is missing, no dependency information available [WARNING] The POM for fr.paris.lutece.plugins:library-rbac-api:jar:1.0.0-SNAPSHOT is missing, no dependency information available [WARNING] The POM for fr.paris.lutece.plugins:library-workgroup-api:jar:1.0.0-SNAPSHOT is missing, no dependency information available [WARNING] The POM for fr.paris.lutece.plugins:library-freemarker:jar:1.0.0-SNAPSHOT is missing, no dependency information available [WARNING] The POM for fr.paris.lutece.plugins:library-workflow-core:jar:1.0.0-SNAPSHOT is missing, no dependency information available [WARNING] The POM for fr.paris.lutece.plugins:plugin-upload:jar:1.0.2-SNAPSHOT is missing, no dependency information available Downloading: http://dev.lutece.paris.fr/snapshot_repository/fr/paris/lutece/plugins/plugin-livreblanc/1.0.0-SNAPSHOT/maven-metadata.xml Downloading: http://dev.lutece.paris.fr/maven_repository/fr/paris/lutece/plugins/plugin-livreblanc/1.0.0-SNAPSHOT/maven-metadata.xml mars 05, 2014 4:00:49 PM org.apache.maven.wagon.providers.http.httpclient.client.protocol.ResponseProcessCookies processCookies WARNING: Cookie rejected: [version: 0][name: JSESSIONID][value: 6FBD8D80B2DFE8A595C1B56526E72A0A][domain: dev.lutece.paris.fr][path: /nexus][expiry: null]. Illegal path attribute /nexus. Path of origin: /maven_repository/fr/paris/lutece/plugins/plugin-livreblanc/1.0.0-SNAPSHOT/maven-metadata.xml mars 05, 2014 4:00:49 PM org.apache.maven.wagon.providers.http.httpclient.client.protocol.ResponseProcessCookies processCookies WARNING: Cookie rejected: [version: 0][name: JSESSIONID][value: 03A11963E0E9E7CC0812EA13334B4709][domain: dev.lutece.paris.fr][path: /nexus][expiry: null]. Illegal path attribute /nexus. Path of origin: /snapshot_repository/fr/paris/lutece/plugins/plugin-livreblanc/1.0.0-SNAPSHOT/maven-metadata.xml Downloading: http://dev.lutece.paris.fr/maven_repository/fr/paris/lutece/plugins/plugin-livreblanc/1.0.0-SNAPSHOT/plugin-livreblanc-1.0.0-SNAPSHOT.pom mars 05, 2014 4:00:50 PM org.apache.maven.wagon.providers.http.httpclient.client.protocol.ResponseProcessCookies processCookies WARNING: Cookie rejected: [version: 0][name: JSESSIONID][value: C9700F37376C61F032ECAA10728F96CE][domain: dev.lutece.paris.fr][path: /nexus][expiry: null]. Illegal path attribute /nexus. Path of origin: /maven_repository/fr/paris/lutece/plugins/plugin-livreblanc/1.0.0-SNAPSHOT/plugin-livreblanc-1.0.0-SNAPSHOT.pom Downloading: http://dev.lutece.paris.fr/snapshot_repository/fr/paris/lutece/plugins/plugin-livreblanc/1.0.0-SNAPSHOT/plugin-livreblanc-1.0.0-SNAPSHOT.pom mars 05, 2014 4:00:50 PM org.apache.maven.wagon.providers.http.httpclient.client.protocol.ResponseProcessCookies processCookies WARNING: Cookie rejected: [version: 0][name: JSESSIONID][value: CAFED7D64F567F9D3CF9891EA0A79662][domain: dev.lutece.paris.fr][path: /nexus][expiry: null]. Illegal path attribute /nexux. Path of origin: /snapshot_repository/fr/paris/lutece/plugins/plugin-livreblanc/1.0.0-SNAPSHOT/plugin-livreblanc-1.0.0-SNAPSHOT.pom [WARNING] The POM for fr.paris.lutece.plugins:plugin-livreblanc:jar:1.0.0-SNAPSHOT is missing, no dependency information available Downloading: http://dev.lutece.paris.fr/maven_repository/fr/paris/lutece/plugins/plugin-article/1.0.0-SNAPSHOT/maven-metadata.xml Downloading: http://dev.lutece.paris.fr/snapshot_repository/fr/paris/lutece/plugins/plugin-article/1.0.0-SNAPSHOT/maven-metadata.xml mars 05, 2014 4:00:50 PM org.apache.maven.wagon.providers.http.httpclient.client.protocol.ResponseProcessCookies processCookies WARNING: Cookie rejected: [version: 0][name: JSESSIONID][value: D243C4CEADDD785F5C5330A51CA62CA2][domain: dev.lutece.paris.fr][path: /nexus][expiry: null]. Illegal path attribute /nexus. Path of origin: /maven_repository/fr/paris/lutece/plugins/plugin-article/1.0.0-SNAPSHOT/maven-metadata.xml mars 05, 2014 4:00:50 PM org.apache.maven.wagon.providers.http.httpclient.client.protocol.ResponseProcessCookies processCookies WARNING: Cookie rejected: [version: 0][name: JSESSIONID][value: BC6D09B02776DFFF070A6E5838F3ADEF][domain: dev.lutece.paris.fr][path: /nexus][expiry: null]. Illegal path attribute /nexus. Path of origin: /snapshot_repository/fr/paris/lutece/plugins/plugin-article/1.0.0-SNAPSHOT/maven-metadata.xml Downloading: http://dev.lutece.paris.fr/maven_repository/fr/paris/lutece/plugins/plugin-article/1.0.0-SNAPSHOT/plugin-article-1.0.0-SNAPSHOT.pom mars 05, 2014 4:00:50 PM org.apache.maven.wagon.providers.http.httpclient.client.protocol.ResponseProcessCookies processCookies WARNING: Cookie rejected: [version: 0][name: JSESSIONID][value: 94727749CD828E3B289C22B7748490DA][domain: dev.lutece.paris.fr][path: /nexus][expiry: null]. Illegal path attribute /nexus. Path of origin: /maven_repository/fr/paris/lutece/plugins/plugin-article/1.0.0-SNAPSHOT/plugin-article-1.0.0-SNAPSHOT.pom Downloading: http://dev.lutece.paris.fr/snapshot_repository/fr/paris/lutece/plugins/plugin-article/1.0.0-SNAPSHOT/plugin-article-1.0.0-SNAPSHOT.pom mars 05, 2014 4:00:50 PM org.apache.maven.wagon.providers.http.httpclient.client.protocol.ResponseProcessCookies processCookies WARNING: Cookie rejected: [version: 0][name: JSESSIONID][value: 516F558B4F31116AA3BBCE5FEB8E5987][domain: dev.lutece.paris.fr][path: /nexus][expiry: null]. Illegal path attribute /nexus. Path of origin: /snapshot_repository/fr/paris/lutece/plugins/plugin-article/1.0.0-SNAPSHOT/plugin-article-1.0.0-SNAPSHOT.pom [WARNING] The POM for fr.paris.lutece.plugins:plugin-article:jar:1.0.0-SNAPSHOT is missing, no dependency information available Downloading: http://dev.lutece.paris.fr/maven_repository/fr/paris/lutece/plugins/plugin-search/1.0.0-SNAPSHOT/maven-metadata.xml Downloading: http://dev.lutece.paris.fr/snapshot_repository/fr/paris/lutece/plugins/plugin-search/1.0.0-SNAPSHOT/maven-metadata.xml mars 05, 2014 4:00:51 PM org.apache.maven.wagon.providers.http.httpclient.client.protocol.ResponseProcessCookies processCookies WARNING: Cookie rejected: [version: 0][name: JSESSIONID][value: C8AD1536C7D57011EE0FB6324B229DCF][domain: dev.lutece.paris.fr][path: /nexus][expiry: null]. Illegal path attribute /nexus. Path of origin: /maven_repository/fr/paris/lutece/plugins/plugin-search/1.0.0-SNAPSHOT/maven-metadata.xml mars 05, 2014 4:00:51 PM org.apache.maven.wagon.providers.http.httpclient.client.protocol.ResponseProcessCookies processCookies WARNING: Cookie rejected: [version: 0][name: JSESSIONID][value: 96A0FCFEE0D6207EB76E42447D9BD8B2][domain: dev.lutece.paris.fr][path: /nexus][expiry: null]. Illegal path attribute /nexus. Path of origin: /snapshot_repository/fr/paris/lutece/plugins/plugin-search/1.0.0-SNAPSHOT/maven-metadata.xml Downloading: http://dev.lutece.paris.fr/maven_repository/fr/paris/lutece/plugins/plugin-search/1.0.0-SNAPSHOT/plugin-search-1.0.0-SNAPSHOT.pom mars 05, 2014 4:00:51 PM org.apache.maven.wagon.providers.http.httpclient.client.protocol.ResponseProcessCookies processCookies WARNING: Cookie rejected: [version: 0][name: JSESSIONID][value: 0CBAB793F76D80764A338491866DAF47][domain: dev.lutece.paris.fr][path: /nexus][expiry: null]. Illegal path attribute /nexus. Path of origin: /maven_repository/fr/paris/lutece/plugins/plugin-search/1.0.0-SNAPSHOT/plugin-search-1.0.0-SNAPSHOT.pom Downloading: http://dev.lutece.paris.fr/snapshot_repository/fr/paris/lutece/plugins/plugin-search/1.0.0-SNAPSHOT/plugin-search-1.0.0-SNAPSHOT.pom mars 05, 2014 4:00:51 PM org.apache.maven.wagon.providers.http.httpclient.client.protocol.ResponseProcessCookies processCookies WARNING: Cookie rejected: [version: 0][name: JSESSIONID][value: D74A44B09BF12884752BA660C6E6B166][domain: dev.lutece.paris.fr][path: /nexus][expiry: null]. Illegal path attribute /nexus. Path of origin: /snapshot_repository/fr/paris/lutece/plugins/plugin-search/1.0.0-SNAPSHOT/plugin-search-1.0.0-SNAPSHOT.pom [WARNING] The POM for fr.paris.lutece.plugins:plugin-search:jar:1.0.0-SNAPSHOT is missing, no dependency information available Downloading: http://dev.lutece.paris.fr/maven_repository/fr/paris/lutece/plugins/plugin-uploadimage/1.0.2-SNAPSHOT/maven-metadata.xml Downloading: http://dev.lutece.paris.fr/snapshot_repository/fr/paris/lutece/plugins/plugin-uploadimage/1.0.2-SNAPSHOT/maven-metadata.xml mars 05, 2014 4:00:51 PM org.apache.maven.wagon.providers.http.httpclient.client.protocol.ResponseProcessCookies processCookies WARNING: Cookie rejected: [version: 0][name: JSESSIONID][value: 25EDDE8DC53EC35229E295C14099D38F][domain: dev.lutece.paris.fr][path: /nexus][expiry: null]. Illegal path attribute /nexus. Path of origin: /maven_repository/fr/paris/lutece/plugins/plugin-uploadimage/1.0.2-SNAPSHOT/maven-metadata.xml mars 05, 2014 4:00:51 PM org.apache.maven.wagon.providers.http.httpclient.client.protocol.ResponseProcessCookies processCookies WARNING: Cookie rejected: [version: 0][name: JSESSIONID][value: BF7F85B250F31B05561E1232D43851FF][domain: dev.lutece.paris.fr][path: /nexus][expiry: null]. Illegal path attribute /nexus. Path of origin: /snapshot_repository/fr/paris/lutece/plugins/plugin-uploadimage/1.0.2-SNAPSHOT/maven-metadata.xml Downloading: http://dev.lutece.paris.fr/maven_repository/fr/paris/lutece/plugins/plugin-uploadimage/1.0.2-SNAPSHOT/plugin-uploadimage-1.0.2-SNAPSHOT.pom mars 05, 2014 4:00:52 PM org.apache.maven.wagon.providers.http.httpclient.client.protocol.ResponseProcessCookies processCookies WARNING: Cookie rejected: [version: 0][name: JSESSIONID][value: 83ABA2B72776B51AAA8DF0D22898E01B][domain: dev.lutece.paris.fr][path: /nexus][expiry: null]. Illegal path attribute /nexus. Path of origin: /maven_repository/fr/paris/lutece/plugins/plugin-uploadimage/1.0.2-SNAPSHOT/plugin-uploadimage-1.0.2-SNAPSHOT.pom Downloading: http://dev.lutece.paris.fr/snapshot_repository/fr/paris/lutece/plugins/plugin-uploadimage/1.0.2-SNAPSHOT/plugin-uploadimage-1.0.2-SNAPSHOT.pom mars 05, 2014 4:00:52 PM org.apache.maven.wagon.providers.http.httpclient.client.protocol.ResponseProcessCookies processCookies WARNING: Cookie rejected: [version: 0][name: JSESSIONID][value: CBB557C4ED2627EC0E105BA22B34C0E5][domain: dev.lutece.paris.fr][path: /nexus][expiry: null]. Illegal path attribute /nexus. Path of origin: /snapshot_repository/fr/paris/lutece/plugins/plugin-uploadimage/1.0.2-SNAPSHOT/plugin-uploadimage-1.0.2-SNAPSHOT.pom [WARNING] The POM for fr.paris.lutece.plugins:plugin-uploadimage:jar:1.0.2-SNAPSHOT is missing, no dependency information available [INFO] ------------------------------------------------------------------------ [INFO] BUILD FAILURE [INFO] ------------------------------------------------------------------------ [INFO] Total time: 6.581s [INFO] Finished at: Wed Mar 05 16:00:52 GMT 2014 [INFO] Final Memory: 18M/179M [INFO] ------------------------------------------------------------------------ [ERROR] Failed to execute goal on project Transfusion: Could not resolve dependencies for project fr.paris.lutece:Transfusion:lutece-site:2.0: Failed to collect dependencies for fr.paris.lutece:Transfusion:lutece-site:2.0: Could not resolve version conflict among [fr.paris.lutece:lutece-core:jar:3.1.6, fr.paris.lutece.plugins:plugin-html:jar:2.1.3 - fr.paris.lutece:lutece-core:jar:[2.3.0,4.0.0-SNAPSHOT), fr.paris.lutece.plugins:plugin-newsletter:jar:2.2.10-SNAPSHOT - fr.paris.lutece:lutece-core:jar:[2.3.0,5.0.0-SNAPSHOT), fr.paris.lutece.plugins:plugin-newsletter:jar:2.2.10-SNAPSHOT - fr.paris.lutece.plugins:plugin-document:jar:[2.0.14,5.0.0-SNAPSHOT) - fr.paris.lutece:lutece-core:jar:[4.1.0-SNAPSHOT,5.0.0-SNAPSHOT), fr.paris.lutece.plugins:plugin-jcaptcha:jar:2.1.5-SNAPSHOT - fr.paris.lutece:lutece-core:jar:[2.4.0,5.0.0-SNAPSHOT), fr.paris.lutece.plugins:plugin-contact:jar:2.1.4 - fr.paris.lutece:lutece-core:jar:[2.3.1,4.0.0-SNAPSHOT), fr.paris.lutece.plugins:library-lutece-unit-testing:jar:2.0.6 - fr.paris.lutece:lutece-core:jar:RELEASE] - [Help 1] [ERROR] [ERROR] To see the full stack trace of the errors, re-run Maven with the -e switch. [ERROR] Re-run Maven using the -X switch to enable full debug logging. [ERROR] [ERROR] For more information about the errors and possible solutions, please read the following articles: [ERROR] [Help 1] http://cwiki.apache.org/confluence/display/MAVEN/DependencyResolutionException

: JGO
Bonjour, Il y a un problème de cohérence de versions du lutece-core. Les versions suivantes sont en dépendance du core : lutece-core:jar:3.1.6 lutece-core:jar:[2.3.0,4.0.0-SNAPSHOT) lutece-core:jar:[2.3.0,5.0.0-SNAPSHOT) lutece-core:jar:[4.1.0-SNAPSHOT,5.0.0-SNAPSHOT) lutece-core:jar:[2.4.0,5.0.0-SNAPSHOT) lutece-core:jar:[2.3.1,4.0.0-SNAPSHOT) Les plages de versions des dépendances du core ne permettent pas de définir quelle version utiliser pour le composant lutece-core. Une possibilité est d'exclure les dépences au core des plugins Lutèce. JGO

 

nestor-systeme
Merci bcp pour la reponse . Comment je peux exclure les dépendances au core des plugins Lutèce?

: JGO
Le mécanisme d'exclusion est décrit sur la doc maven : https://maven.apache.org/guides/introduction/introduction-to-optional-and-excludes-dependencies.html